{"text_format":"1","workbook":"xlsx","n_sheets":9,"sheets":["Instructions","Input","Summary","Graphs","Measures","References","Pivot Tables","Emission Factors","Drop down menus"],"not_rendered":{"charts":12,"images":2,"macros":1,"external_links":0,"defined_names":1,"comments":0,"pivot_tables":3},"unopened":[],"bounds":{"document_bytes":16777216,"sheet_cells":100000,"rows_first":2000,"rows_last":500,"rows_between":2000,"halvings":0,"cell_chars":16384,"cell_head_chars":4096},"cells_cut":0,"cells_raw":0,"read":"whole","date_system":"1900"}

{"sheet":"Instructions","index":0,"n_rows":25,"n_cols":2,"rows_kept":25,"cut":false,"hidden":false,"merged":[]}
[]
[null,"Buildings GHG Mitigation Estimator Worksheet, Version 1"]
[null,"Version updated January 31, 2013"]
[null,"This tool assists Federal agencies in estimating the greenhouse gas mitigation reduction from implementing  energy efficiency measures across a portfolio of buildings.  The tool is designed to be applied to groups of office buildings, for example at a program, regional, or site level, and can be summarized at the agency level.  While the default savings and cost estimates apply to office buildings, users can define their own efficiency measures, costs, and savings estimates for inclusion in the portfolio assessment.  More information on user-defined measures can be found in Step 2 of the Buildings Emission Reduction guidance.  The output of this tool is a prioritized set of activities that can help the agency to achieve its greenhouse gas reduction targets most cost-effectively.  "]
[]
[null,"The default savings estimates in this tool are taken from the U.S. Department of Energy (DOE)'s Advanced Energy Retrofit Guides, and assume the buildings analyzed use electricity and natural gas.  Savings estimates for buildings that use other fuel types may differ slightly from the values presented in this tool.  Before pursuing actual projects within a building, building audits should be performed to develop a more comprehensive understanding of the systems in place and the energy savings potential."]
[]
[null,"Before starting, the agency should  identify priority groups of buildings and building types to analyze further.  Those data serve as the primary inputs to this tool.  The process of data collection and analysis is described in Step 2 of the Buildings Emission Reduction guidance on the FEMP greenhouse gas mitigation website.  "]
[]
[null,"Follow the instructions in the Input and Summary worksheets to develop mitigation estimates. "]
[null,"Key"]
[null,"Only orange cells require user inputs. "]
[null,"Grey cells are automatic calculations."]
[null,"Blue cells are reference-based assumptions.  "]
[]
[null,"Worksheets"]
[null,"Input: Enter the information requested for the portfolio of buildings in the assessment. Calculations for each entry are provided here."]
[null,"Summary: Calculates the agency-wide results, and lists the aggregated results for the agency, programs, and sites.  This also lists the results for each measure when implemented across the agency as the user indicates.  "]
[null,"Graphs: Provides a visual summary of the aggregated results for the  programs, sites and measures. "]
[null,"Measures: Lists the background calculations of the measures with user-defined measures in  Rows 72 to 76. "]
[null,"References: Lists the references used within the worksheets to calculate the GHG reduction potential."]
[]
[null,"NOTES:  "]
[null,"1. Macros must be enabled for the embedded calculations to operate properly."]
[null,"2. This estimator was developed using Microsoft Excel 2010.  Contact FEMP if using an older version of Microsoft Excel and are experiencing errors."]

{"sheet":"Input","index":1,"n_rows":73,"n_cols":30,"rows_kept":73,"cut":false,"hidden":false,"merged":[[2,2,2,3],[3,2,3,3],[4,2,4,3]]}
[null,"Buildings Portfolio GHG Mitigation Estimator - (Worksheet with Example Data)"]
[]
[null,"Key: ","User Entered",null,null,"Agency:",null,"ABC"]
[null,null,"Calculated",null,null,"Baseline (2008) Buildings Emissions:",null,40305755]
[null,null,"Reference-based value"]
[]
[]
[]
[null,null,null,null,null,null,null,null,null,null,null,null,null,null,null,null,"Total Annual Energy Savings (kBtu)","Total Annual Electricity GHG Reduction (MTCO2e)","Total Annual Natural Gas GHG Reduction (MTCO2e)","Total Annual GHG Reduction (MTCO2e)",null,null,"Total Cumulative GHG Reduction (MTCO2e)",null,"Total Capital Cost ($)",null,"Total Annual Cost Savings \n($/year)","Average Simple Payback \n(years)"]
[null,"Required Inputs",null,null,null,null,null,null,null,null,null,null,"Calculations used in Estimator - No Input Needed",null,null,null,{"$f":"SUM(Q13:Q68)","v":115367217.3584},{"$f":"SUM(R13:R68)","v":553.05368573280191},{"$f":"SUM(S13:S68)","v":3630.6555200000007},{"$f":"SUM(T13:T68)","v":4183.7092057328009},null,null,{"$f":"SUM(W13:W68)","v":83378.417959151586},null,{"$f":"SUM(Y13:Y68)","v":5766675.4000000004},null,{"$f":"SUM(AA13:AA68)","v":2160640},{"$f":"Y10/AA10","v":2.6689663247926543}]
[]
[null,"Program Name","Site Name","Climate Type1\n(drop down menu)","Total Building Floor Area (SF)","eGRID Region2\n(drop down menu)","Default Measure or \nUser-defined Measure?\n(drop down menu)","Measure Name3\n(drop down menu)","Applicable SF (%)","Ease of Implementation","Proceed to Step 5 - Summary\n(click here)","blank","eGRID Emission Factor (kg CO2e/kBtu)","Electricity Savings (kBtu/sf)","Natural Gas Savings (kBtu/sf)","Energy Savings (kBtu/sf)","Annual Energy Savings (kBtu/yr)","Electricity Annual GHG Reduction (MTCO2e)","Natural Gas Annual GHG Reduction (MTCO2e)","Annual GHG Reduction (MTCO2e/year)","Annual GHG Reduction (MTCO2e/KSF)","Effective Useful Life (years)","Cumulative GHG Reduction (MTCO2e)","Capital Cost Index ($/sf)","Capital Cost ($)","Annual Cost Savings ($/sf)","Annual Cost Savings ($/year)","Simple Payback (years)","Cost Effectiveness ($/MTCO2e)","Rank (based on $/MTCO2e)"]
[null,"Program B","Site 3","Cold",2200000,"RFC West","Default","Replace the tenant server room cooling units with more efficient units",0.4,"High",null,null,{"$f":"IF(F13<>0,VLOOKUP(F13,'Emission Factors'!$A$4:$J$31,7,FALSE),\" \")","v":8.2186499260643569E-3},{"$f":"IF($G13=\"User-defined Measure\",VLOOKUP($H13,Measures!$C$73:$W$77,16,FALSE),IF($D13=\"Hot & Humid\",VLOOKUP($H13,Measures!$C$6:$W$19,16,FALSE),IF($D13=\"Hot & Dry\",VLOOKUP($H13,Measures!$C$20:$W$32,16,FALSE),IF($D13=\"Marine\",VLOOKUP($H13,Measures!$C$33:$W$45,16,FALSE),IF($D13=\"Cold\",VLOOKUP($H13,Measures!$C$46:$W$58,16,FALSE),IF($D13=\"Very Cold\",VLOOKUP($H13,Measures!$C$59:$W$72,16,FALSE),\" \"))))))","v":0.83428518000000007},{"$f":"IF($G13=\"User-defined Measure\",VLOOKUP($H13,Measures!$C$73:$W$77,19,FALSE),IF($D13=\"Hot & Humid\",VLOOKUP($H13,Measures!$C$6:$W$19,19,FALSE),IF($D13=\"Hot & Dry\",VLOOKUP($H13,Measures!$C$20:$W$32,19,FALSE),IF($D13=\"Marine\",VLOOKUP($H13,Measures!$C$33:$W$45,19,FALSE),IF($D13=\"Cold\",VLOOKUP($H13,Measures!$C$46:$W$58,19,FALSE),IF($D13=\"Very Cold\",VLOOKUP($H13,Measures!$C$59:$W$72,19,FALSE),\" \"))))))","v":0},{"$f":"IF(B13=0,\" \",SUM(N13,O13))","v":0.83428518000000007},{"$f":"IF(B13=0,\" \",SUM(N13,O13)*E13*I13)","v":734170.95840000012},{"$f":"IF(B13=0,\" \",PRODUCT(M13,N13,E13,I13)/1000)","v":6.0338940929727585},{"$f":"IF(B13=0,\" \",PRODUCT(O13,'Emission Factors'!$J$36,E13,I13)/1000)","v":0},{"$f":"IF(B13=0,\" \",R13+S13)","v":6.0338940929727585},{"$f":"IF(E13=0,\"\",PRODUCT(1000,(T13/PRODUCT(E13,I13))))","v":6.8566978329235887E-3},{"$f":"IF($G13=\"User-defined Measure\",VLOOKUP($H13,Measures!$C$73:$X$77,22,FALSE),IF($D13=\"Hot & Humid\",VLOOKUP($H13,Measures!$C$6:$X$19,22,FALSE),IF($D13=\"Hot & Dry\",VLOOKUP($H13,Measures!$C$20:$X$32,22,FALSE),IF($D13=\"Marine\",VLOOKUP($H13,Measures!$C$33:$X$45,22,FALSE),IF($D13=\"Cold\",VLOOKUP($H13,Measures!$C$46:$X$58,22,FALSE),IF($D13=\"Very Cold\",VLOOKUP($H13,Measures!$C$59:$X$72,22,FALSE),\" \"))))))","v":15},{"$f":"IF(E13=0,\" \",V13*T13)","v":90.508411394591377},{"$f":"IF($G13=\"User-defined Measure\",VLOOKUP($H13,Measures!$C$73:$W$77,9,FALSE),IF($D13=\"Hot & Humid\",VLOOKUP($H13,Measures!$C$6:$W$19,9,FALSE),IF($D13=\"Hot & Dry\",VLOOKUP($H13,Measures!$C$20:$W$32,9,FALSE),IF($D13=\"Marine\",VLOOKUP($H13,Measures!$C$33:$W$45,9,FALSE),IF($D13=\"Cold\",VLOOKUP($H13,Measures!$C$46:$W$58,9,FALSE),IF($D13=\"Very Cold\",VLOOKUP($H13,Measures!$C$59:$W$72,9,FALSE),\" \"))))))","v":0.25545499999999999},{"$f":"IF(B13=0,\" \",PRODUCT(X13,E13,I13))","v":224800.40000000002},{"$f":"IF($G13=\"User-defined Measure\",VLOOKUP($H13,Measures!$C$73:$W$77,12,FALSE),IF($D13=\"Hot & Humid\",VLOOKUP($H13,Measures!$C$6:$W$19,12,FALSE),IF($D13=\"Hot & Dry\",VLOOKUP($H13,Measures!$C$20:$W$32,12,FALSE),IF($D13=\"Marine\",VLOOKUP($H13,Measures!$C$33:$W$45,12,FALSE),IF($D13=\"Cold\",VLOOKUP($H13,Measures!$C$46:$W$58,12,FALSE),IF($D13=\"Very Cold\",VLOOKUP($H13,Measures!$C$59:$W$72,12,FALSE),\" \"))))))","v":2.5499999999999998E-2},{"$f":"IF(B13=0,\" \",PRODUCT(Z13,E13,I13))","v":22440},{"$f":"IF(B13=0,\" \",Y13/AA13)","v":10.017843137254903},{"$f":"IF(B13=0,\" \",IF(W13 = 0, 0, Y13/W13))","v":2483.751471671877},{"$f":"IF(B13=0,\" \",RANK(AC13,AC$13:AC$68,1))","v":9}]
[null,"Program B","Site 3","Cold",2200000,"RFC West","Default","Standard Retrofit Package",0.2,"Medium",null,null,{"$f":"IF(F14<>0,VLOOKUP(F14,'Emission Factors'!$A$4:$J$31,7,FALSE),\" \")","v":8.2186499260643569E-3},{"$f":"IF($G14=\"User-defined Measure\",VLOOKUP($H14,Measures!$C$73:$W$77,16,FALSE),IF($D14=\"Hot & Humid\",VLOOKUP($H14,Measures!$C$6:$W$19,16,FALSE),IF($D14=\"Hot & Dry\",VLOOKUP($H14,Measures!$C$20:$W$32,16,FALSE),IF($D14=\"Marine\",VLOOKUP($H14,Measures!$C$33:$W$45,16,FALSE),IF($D14=\"Cold\",VLOOKUP($H14,Measures!$C$46:$W$58,16,FALSE),IF($D14=\"Very Cold\",VLOOKUP($H14,Measures!$C$59:$W$72,16,FALSE),\" \"))))))","v":13.750360000000001},{"$f":"IF($G14=\"User-defined Measure\",VLOOKUP($H14,Measures!$C$73:$W$77,19,FALSE),IF($D14=\"Hot & Humid\",VLOOKUP($H14,Measures!$C$6:$W$19,19,FALSE),IF($D14=\"Hot & Dry\",VLOOKUP($H14,Measures!$C$20:$W$32,19,FALSE),IF($D14=\"Marine\",VLOOKUP($H14,Measures!$C$33:$W$45,19,FALSE),IF($D14=\"Cold\",VLOOKUP($H14,Measures!$C$46:$W$58,19,FALSE),IF($D14=\"Very Cold\",VLOOKUP($H14,Measures!$C$59:$W$72,19,FALSE),\" \"))))))","v":19.5},33.250360000000001,14630158.4,49.724133886837656,{"$f":"IF(B14=0,\" \",PRODUCT(O14,'Emission Factors'!$J$36,E14,I14)/1000)","v":455.35776000000004},505.08189388683769,1.1479133951973584,{"$f":"IF($G14=\"User-defined Measure\",VLOOKUP($H14,Measures!$C$73:$X$77,22,FALSE),IF($D14=\"Hot & Humid\",VLOOKUP($H14,Measures!$C$6:$X$19,22,FALSE),IF($D14=\"Hot & Dry\",VLOOKUP($H14,Measures!$C$20:$X$32,22,FALSE),IF($D14=\"Marine\",VLOOKUP($H14,Measures!$C$33:$X$45,22,FALSE),IF($D14=\"Cold\",VLOOKUP($H14,Measures!$C$46:$X$58,22,FALSE),IF($D14=\"Very Cold\",VLOOKUP($H14,Measures!$C$59:$X$72,22,FALSE),\" \"))))))","v":20},{"$f":"IF(E14=0,\" \",V14*T14)","v":10101.637877736754},{"$f":"IF($G14=\"User-defined Measure\",VLOOKUP($H14,Measures!$C$73:$W$77,9,FALSE),IF($D14=\"Hot & Humid\",VLOOKUP($H14,Measures!$C$6:$W$19,9,FALSE),IF($D14=\"Hot & Dry\",VLOOKUP($H14,Measures!$C$20:$W$32,9,FALSE),IF($D14=\"Marine\",VLOOKUP($H14,Measures!$C$33:$W$45,9,FALSE),IF($D14=\"Cold\",VLOOKUP($H14,Measures!$C$46:$W$58,9,FALSE),IF($D14=\"Very Cold\",VLOOKUP($H14,Measures!$C$59:$W$72,9,FALSE),\" \"))))))","v":2.1949999999999998},965800,{"$f":"IF($G14=\"User-defined Measure\",VLOOKUP($H14,Measures!$C$73:$W$77,12,FALSE),IF($D14=\"Hot & Humid\",VLOOKUP($H14,Measures!$C$6:$W$19,12,FALSE),IF($D14=\"Hot & Dry\",VLOOKUP($H14,Measures!$C$20:$W$32,12,FALSE),IF($D14=\"Marine\",VLOOKUP($H14,Measures!$C$33:$W$45,12,FALSE),IF($D14=\"Cold\",VLOOKUP($H14,Measures!$C$46:$W$58,12,FALSE),IF($D14=\"Very Cold\",VLOOKUP($H14,Measures!$C$59:$W$72,12,FALSE),\" \"))))))","v":0.93500000000000005},411400.00000000006,2.3475935828877001,{"$f":"IF(B14=0,\" \",IF(W14 = 0, 0, Y14/W14))","v":95.608257956717125},5]
[null,"Program B","Site 3","Cold",2200000,"RFC West","Default","Major Renovation (Deep Retrofit) Package",0.1,"Low",null,null,{"$f":"IF(F15<>0,VLOOKUP(F15,'Emission Factors'!$A$4:$J$31,7,FALSE),\" \")","v":8.2186499260643569E-3},{"$f":"IF($G15=\"User-defined Measure\",VLOOKUP($H15,Measures!$C$73:$W$77,16,FALSE),IF($D15=\"Hot & Humid\",VLOOKUP($H15,Measures!$C$6:$W$19,16,FALSE),IF($D15=\"Hot & Dry\",VLOOKUP($H15,Measures!$C$20:$W$32,16,FALSE),IF($D15=\"Marine\",VLOOKUP($H15,Measures!$C$33:$W$45,16,FALSE),IF($D15=\"Cold\",VLOOKUP($H15,Measures!$C$46:$W$58,16,FALSE),IF($D15=\"Very Cold\",VLOOKUP($H15,Measures!$C$59:$W$72,16,FALSE),\" \"))))))","v":19.960199999999997},{"$f":"IF($G15=\"User-defined Measure\",VLOOKUP($H15,Measures!$C$73:$W$77,19,FALSE),IF($D15=\"Hot & Humid\",VLOOKUP($H15,Measures!$C$6:$W$19,19,FALSE),IF($D15=\"Hot & Dry\",VLOOKUP($H15,Measures!$C$20:$W$32,19,FALSE),IF($D15=\"Marine\",VLOOKUP($H15,Measures!$C$33:$W$45,19,FALSE),IF($D15=\"Cold\",VLOOKUP($H15,Measures!$C$46:$W$58,19,FALSE),IF($D15=\"Very Cold\",VLOOKUP($H15,Measures!$C$59:$W$72,19,FALSE),\" \"))))))","v":22},41.9602,9231244,36.090097175930545,{"$f":"IF(B15=0,\" \",PRODUCT(O15,'Emission Factors'!$J$36,E15,I15)/1000)","v":256.86847999999998},292.95857717593054,1.3316298962542297,{"$f":"IF($G15=\"User-defined Measure\",VLOOKUP($H15,Measures!$C$73:$X$77,22,FALSE),IF($D15=\"Hot & Humid\",VLOOKUP($H15,Measures!$C$6:$X$19,22,FALSE),IF($D15=\"Hot & Dry\",VLOOKUP($H15,Measures!$C$20:$X$32,22,FALSE),IF($D15=\"Marine\",VLOOKUP($H15,Measures!$C$33:$X$45,22,FALSE),IF($D15=\"Cold\",VLOOKUP($H15,Measures!$C$46:$X$58,22,FALSE),IF($D15=\"Very Cold\",VLOOKUP($H15,Measures!$C$59:$X$72,22,FALSE),\" \"))))))","v":20},5859.1715435186106,{"$f":"IF($G15=\"User-defined Measure\",VLOOKUP($H15,Measures!$C$73:$W$77,9,FALSE),IF($D15=\"Hot & Humid\",VLOOKUP($H15,Measures!$C$6:$W$19,9,FALSE),IF($D15=\"Hot & Dry\",VLOOKUP($H15,Measures!$C$20:$W$32,9,FALSE),IF($D15=\"Marine\",VLOOKUP($H15,Measures!$C$33:$W$45,9,FALSE),IF($D15=\"Cold\",VLOOKUP($H15,Measures!$C$46:$W$58,9,FALSE),IF($D15=\"Very Cold\",VLOOKUP($H15,Measures!$C$59:$W$72,9,FALSE),\" \"))))))","v":4.4249999999999998},973500,{"$f":"IF($G15=\"User-defined Measure\",VLOOKUP($H15,Measures!$C$73:$W$77,12,FALSE),IF($D15=\"Hot & Humid\",VLOOKUP($H15,Measures!$C$6:$W$19,12,FALSE),IF($D15=\"Hot & Dry\",VLOOKUP($H15,Measures!$C$20:$W$32,12,FALSE),IF($D15=\"Marine\",VLOOKUP($H15,Measures!$C$33:$W$45,12,FALSE),IF($D15=\"Cold\",VLOOKUP($H15,Measures!$C$46:$W$58,12,FALSE),IF($D15=\"Very Cold\",VLOOKUP($H15,Measures!$C$59:$W$72,12,FALSE),\" \"))))))","v":0.76500000000000001},168300,5.784313725490196,166.14976925822924,8]
[null,"Program B","Site 2","Marine",4500000,"WECC Northwest","Default","RCx (EBCx) Package",0.3,"Medium",null,null,{"$f":"IF(F16<>0,VLOOKUP(F16,'Emission Factors'!$A$4:$J$31,7,FALSE),\" \")","v":6.936841723290183E-3},{"$f":"IF($G16=\"User-defined Measure\",VLOOKUP($H16,Measures!$C$73:$W$77,16,FALSE),IF($D16=\"Hot & Humid\",VLOOKUP($H16,Measures!$C$6:$W$19,16,FALSE),IF($D16=\"Hot & Dry\",VLOOKUP($H16,Measures!$C$20:$W$32,16,FALSE),IF($D16=\"Marine\",VLOOKUP($H16,Measures!$C$33:$W$45,16,FALSE),IF($D16=\"Cold\",VLOOKUP($H16,Measures!$C$46:$W$58,16,FALSE),IF($D16=\"Very Cold\",VLOOKUP($H16,Measures!$C$59:$W$72,16,FALSE),\" \"))))))","v":6.9945999999999993},{"$f":"IF($G16=\"User-defined Measure\",VLOOKUP($H16,Measures!$C$73:$W$77,19,FALSE),IF($D16=\"Hot & Humid\",VLOOKUP($H16,Measures!$C$6:$W$19,19,FALSE),IF($D16=\"Hot & Dry\",VLOOKUP($H16,Measures!$C$20:$W$32,19,FALSE),IF($D16=\"Marine\",VLOOKUP($H16,Measures!$C$33:$W$45,19,FALSE),IF($D16=\"Cold\",VLOOKUP($H16,Measures!$C$46:$W$58,19,FALSE),IF($D16=\"Very Cold\",VLOOKUP($H16,Measures!$C$59:$W$72,19,FALSE),\" \"))))))","v":18.5},25.494599999999998,34417710,65.502584708929447,{"$f":"IF(B16=0,\" \",PRODUCT(O16,'Emission Factors'!$J$36,E16,I16)/1000)","v":1325.4731999999999},1390.9757847089293,1.0303524331177252,{"$f":"IF($G16=\"User-defined Measure\",VLOOKUP($H16,Measures!$C$73:$X$77,22,FALSE),IF($D16=\"Hot & Humid\",VLOOKUP($H16,Measures!$C$6:$X$19,22,FALSE),IF($D16=\"Hot & Dry\",VLOOKUP($H16,Measures!$C$20:$X$32,22,FALSE),IF($D16=\"Marine\",VLOOKUP($H16,Measures!$C$33:$X$45,22,FALSE),IF($D16=\"Cold\",VLOOKUP($H16,Measures!$C$46:$X$58,22,FALSE),IF($D16=\"Very Cold\",VLOOKUP($H16,Measures!$C$59:$X$72,22,FALSE),\" \"))))))","v":20},27819.515694178586,{"$f":"IF($G16=\"User-defined Measure\",VLOOKUP($H16,Measures!$C$73:$W$77,9,FALSE),IF($D16=\"Hot & Humid\",VLOOKUP($H16,Measures!$C$6:$W$19,9,FALSE),IF($D16=\"Hot & Dry\",VLOOKUP($H16,Measures!$C$20:$W$32,9,FALSE),IF($D16=\"Marine\",VLOOKUP($H16,Measures!$C$33:$W$45,9,FALSE),IF($D16=\"Cold\",VLOOKUP($H16,Measures!$C$46:$W$58,9,FALSE),IF($D16=\"Very Cold\",VLOOKUP($H16,Measures!$C$59:$W$72,9,FALSE),\" \"))))))","v":0.30549999999999999},412425,{"$f":"IF($G16=\"User-defined Measure\",VLOOKUP($H16,Measures!$C$73:$W$77,12,FALSE),IF($D16=\"Hot & Humid\",VLOOKUP($H16,Measures!$C$6:$W$19,12,FALSE),IF($D16=\"Hot & Dry\",VLOOKUP($H16,Measures!$C$20:$W$32,12,FALSE),IF($D16=\"Marine\",VLOOKUP($H16,Measures!$C$33:$W$45,12,FALSE),IF($D16=\"Cold\",VLOOKUP($H16,Measures!$C$46:$W$58,12,FALSE),IF($D16=\"Very Cold\",VLOOKUP($H16,Measures!$C$59:$W$72,12,FALSE),\" \"))))))","v":0.36},486000,0.84861111111111109,14.825024437298259,1]
[null,"Program B","Site 2","Marine",4500000,"WECC Northwest","Default","Standard Retrofit Package",0.1,"High",null,null,{"$f":"IF(F17<>0,VLOOKUP(F17,'Emission Factors'!$A$4:$J$31,7,FALSE),\" \")","v":6.936841723290183E-3},{"$f":"IF($G17=\"User-defined Measure\",VLOOKUP($H17,Measures!$C$73:$W$77,16,FALSE),IF($D17=\"Hot & Humid\",VLOOKUP($H17,Measures!$C$6:$W$19,16,FALSE),IF($D17=\"Hot & Dry\",VLOOKUP($H17,Measures!$C$20:$W$32,16,FALSE),IF($D17=\"Marine\",VLOOKUP($H17,Measures!$C$33:$W$45,16,FALSE),IF($D17=\"Cold\",VLOOKUP($H17,Measures!$C$46:$W$58,16,FALSE),IF($D17=\"Very Cold\",VLOOKUP($H17,Measures!$C$59:$W$72,16,FALSE),\" \"))))))","v":14.944559999999999},{"$f":"IF($G17=\"User-defined Measure\",VLOOKUP($H17,Measures!$C$73:$W$77,19,FALSE),IF($D17=\"Hot & Humid\",VLOOKUP($H17,Measures!$C$6:$W$19,19,FALSE),IF($D17=\"Hot & Dry\",VLOOKUP($H17,Measures!$C$20:$W$32,19,FALSE),IF($D17=\"Marine\",VLOOKUP($H17,Measures!$C$33:$W$45,19,FALSE),IF($D17=\"Cold\",VLOOKUP($H17,Measures!$C$46:$W$58,19,FALSE),IF($D17=\"Very Cold\",VLOOKUP($H17,Measures!$C$59:$W$72,19,FALSE),\" \"))))))","v":25.5},40.444559999999996,18200051.999999996,46.650621304896092,{"$f":"IF(B17=0,\" \",PRODUCT(O17,'Emission Factors'!$J$36,E17,I17)/1000)","v":609.00120000000004},655.65182130489609,1.4570040473442134,{"$f":"IF($G17=\"User-defined Measure\",VLOOKUP($H17,Measures!$C$73:$X$77,22,FALSE),IF($D17=\"Hot & Humid\",VLOOKUP($H17,Measures!$C$6:$X$19,22,FALSE),IF($D17=\"Hot & Dry\",VLOOKUP($H17,Measures!$C$20:$X$32,22,FALSE),IF($D17=\"Marine\",VLOOKUP($H17,Measures!$C$33:$X$45,22,FALSE),IF($D17=\"Cold\",VLOOKUP($H17,Measures!$C$46:$X$58,22,FALSE),IF($D17=\"Very Cold\",VLOOKUP($H17,Measures!$C$59:$X$72,22,FALSE),\" \"))))))","v":20},13113.036426097922,{"$f":"IF($G17=\"User-defined Measure\",VLOOKUP($H17,Measures!$C$73:$W$77,9,FALSE),IF($D17=\"Hot & Humid\",VLOOKUP($H17,Measures!$C$6:$W$19,9,FALSE),IF($D17=\"Hot & Dry\",VLOOKUP($H17,Measures!$C$20:$W$32,9,FALSE),IF($D17=\"Marine\",VLOOKUP($H17,Measures!$C$33:$W$45,9,FALSE),IF($D17=\"Cold\",VLOOKUP($H17,Measures!$C$46:$W$58,9,FALSE),IF($D17=\"Very Cold\",VLOOKUP($H17,Measures!$C$59:$W$72,9,FALSE),\" \"))))))","v":2.1949999999999998},987750,{"$f":"IF($G17=\"User-defined Measure\",VLOOKUP($H17,Measures!$C$73:$W$77,12,FALSE),IF($D17=\"Hot & Humid\",VLOOKUP($H17,Measures!$C$6:$W$19,12,FALSE),IF($D17=\"Hot & Dry\",VLOOKUP($H17,Measures!$C$20:$W$32,12,FALSE),IF($D17=\"Marine\",VLOOKUP($H17,Measures!$C$33:$W$45,12,FALSE),IF($D17=\"Cold\",VLOOKUP($H17,Measures!$C$46:$W$58,12,FALSE),IF($D17=\"Very Cold\",VLOOKUP($H17,Measures!$C$59:$W$72,12,FALSE),\" \"))))))","v":0.995},447750,2.2060301507537687,75.325803109503539,4]
[null,"Program B","Site 2","Hot & Dry",200000,"WECC Northwest","User-defined Measure","Install IR heating",0.2,"Low",null,null,{"$f":"IF(F18<>0,VLOOKUP(F18,'Emission Factors'!$A$4:$J$31,7,FALSE),\" \")","v":6.936841723290183E-3},{"$f":"IF($G18=\"User-defined Measure\",VLOOKUP($H18,Measures!$C$73:$W$77,16,FALSE),IF($D18=\"Hot & Humid\",VLOOKUP($H18,Measures!$C$6:$W$19,16,FALSE),IF($D18=\"Hot & Dry\",VLOOKUP($H18,Measures!$C$20:$W$32,16,FALSE),IF($D18=\"Marine\",VLOOKUP($H18,Measures!$C$33:$W$45,16,FALSE),IF($D18=\"Cold\",VLOOKUP($H18,Measures!$C$46:$W$58,16,FALSE),IF($D18=\"Very Cold\",VLOOKUP($H18,Measures!$C$59:$W$72,16,FALSE),\" \"))))))","v":8.5300000000000015E-2},{"$f":"IF($G18=\"User-defined Measure\",VLOOKUP($H18,Measures!$C$73:$W$77,19,FALSE),IF($D18=\"Hot & Humid\",VLOOKUP($H18,Measures!$C$6:$W$19,19,FALSE),IF($D18=\"Hot & Dry\",VLOOKUP($H18,Measures!$C$20:$W$32,19,FALSE),IF($D18=\"Marine\",VLOOKUP($H18,Measures!$C$33:$W$45,19,FALSE),IF($D18=\"Cold\",VLOOKUP($H18,Measures!$C$46:$W$58,19,FALSE),IF($D18=\"Very Cold\",VLOOKUP($H18,Measures!$C$59:$W$72,19,FALSE),\" \"))))))","v":12.5},12.5853,503412,2.3668503959866111E-2,{"$f":"IF(B18=0,\" \",PRODUCT(O18,'Emission Factors'!$J$36,E18,I18)/1000)","v":26.536000000000001},26.559668503959866,0.6639917125989967,{"$f":"IF($G18=\"User-defined Measure\",VLOOKUP($H18,Measures!$C$73:$X$77,22,FALSE),IF($D18=\"Hot & Humid\",VLOOKUP($H18,Measures!$C$6:$X$19,22,FALSE),IF($D18=\"Hot & Dry\",VLOOKUP($H18,Measures!$C$20:$X$32,22,FALSE),IF($D18=\"Marine\",VLOOKUP($H18,Measures!$C$33:$X$45,22,FALSE),IF($D18=\"Cold\",VLOOKUP($H18,Measures!$C$46:$X$58,22,FALSE),IF($D18=\"Very Cold\",VLOOKUP($H18,Measures!$C$59:$X$72,22,FALSE),\" \"))))))","v":10},265.59668503959864,{"$f":"IF($G18=\"User-defined Measure\",VLOOKUP($H18,Measures!$C$73:$W$77,9,FALSE),IF($D18=\"Hot & Humid\",VLOOKUP($H18,Measures!$C$6:$W$19,9,FALSE),IF($D18=\"Hot & Dry\",VLOOKUP($H18,Measures!$C$20:$W$32,9,FALSE),IF($D18=\"Marine\",VLOOKUP($H18,Measures!$C$33:$W$45,9,FALSE),IF($D18=\"Cold\",VLOOKUP($H18,Measures!$C$46:$W$58,9,FALSE),IF($D18=\"Very Cold\",VLOOKUP($H18,Measures!$C$59:$W$72,9,FALSE),\" \"))))))","v":0.5},20000,{"$f":"IF($G18=\"User-defined Measure\",VLOOKUP($H18,Measures!$C$73:$W$77,12,FALSE),IF($D18=\"Hot & Humid\",VLOOKUP($H18,Measures!$C$6:$W$19,12,FALSE),IF($D18=\"Hot & Dry\",VLOOKUP($H18,Measures!$C$20:$W$32,12,FALSE),IF($D18=\"Marine\",VLOOKUP($H18,Measures!$C$33:$W$45,12,FALSE),IF($D18=\"Cold\",VLOOKUP($H18,Measures!$C$46:$W$58,12,FALSE),IF($D18=\"Very Cold\",VLOOKUP($H18,Measures!$C$59:$W$72,12,FALSE),\" \"))))))","v":0.15},6000,3.3333333333333335,75.302144667272998,3]
[null,"Program B","Site 4","Hot & Humid",2200000,"FRCC All","Default","RCx (EBCx) Package",0.5,"Medium",null,null,{"$f":"IF(F19<>0,VLOOKUP(F19,'Emission Factors'!$A$4:$J$31,7,FALSE),\" \")","v":1.7798078580435632E-2},{"$f":"IF($G19=\"User-defined Measure\",VLOOKUP($H19,Measures!$C$73:$W$77,16,FALSE),IF($D19=\"Hot & Humid\",VLOOKUP($H19,Measures!$C$6:$W$19,16,FALSE),IF($D19=\"Hot & Dry\",VLOOKUP($H19,Measures!$C$20:$W$32,16,FALSE),IF($D19=\"Marine\",VLOOKUP($H19,Measures!$C$33:$W$45,16,FALSE),IF($D19=\"Cold\",VLOOKUP($H19,Measures!$C$46:$W$58,16,FALSE),IF($D19=\"Very Cold\",VLOOKUP($H19,Measures!$C$59:$W$72,16,FALSE),\" \"))))))","v":5.4421400000000002},{"$f":"IF($G19=\"User-defined Measure\",VLOOKUP($H19,Measures!$C$73:$W$77,19,FALSE),IF($D19=\"Hot & Humid\",VLOOKUP($H19,Measures!$C$6:$W$19,19,FALSE),IF($D19=\"Hot & Dry\",VLOOKUP($H19,Measures!$C$20:$W$32,19,FALSE),IF($D19=\"Marine\",VLOOKUP($H19,Measures!$C$33:$W$45,19,FALSE),IF($D19=\"Cold\",VLOOKUP($H19,Measures!$C$46:$W$58,19,FALSE),IF($D19=\"Very Cold\",VLOOKUP($H19,Measures!$C$59:$W$72,19,FALSE),\" \"))))))","v":8},13.44214,14786354,106.54559890230517,{"$f":"IF(B19=0,\" \",PRODUCT(O19,'Emission Factors'!$J$36,E19,I19)/1000)","v":467.03360000000004},573.57919890230517,0.5214356353657319,{"$f":"IF($G19=\"User-defined Measure\",VLOOKUP($H19,Measures!$C$73:$X$77,22,FALSE),IF($D19=\"Hot & Humid\",VLOOKUP($H19,Measures!$C$6:$X$19,22,FALSE),IF($D19=\"Hot & Dry\",VLOOKUP($H19,Measures!$C$20:$X$32,22,FALSE),IF($D19=\"Marine\",VLOOKUP($H19,Measures!$C$33:$X$45,22,FALSE),IF($D19=\"Cold\",VLOOKUP($H19,Measures!$C$46:$X$58,22,FALSE),IF($D19=\"Very Cold\",VLOOKUP($H19,Measures!$C$59:$X$72,22,FALSE),\" \"))))))","v":20},11471.583978046103,{"$f":"IF($G19=\"User-defined Measure\",VLOOKUP($H19,Measures!$C$73:$W$77,9,FALSE),IF($D19=\"Hot & Humid\",VLOOKUP($H19,Measures!$C$6:$W$19,9,FALSE),IF($D19=\"Hot & Dry\",VLOOKUP($H19,Measures!$C$20:$W$32,9,FALSE),IF($D19=\"Marine\",VLOOKUP($H19,Measures!$C$33:$W$45,9,FALSE),IF($D19=\"Cold\",VLOOKUP($H19,Measures!$C$46:$W$58,9,FALSE),IF($D19=\"Very Cold\",VLOOKUP($H19,Measures!$C$59:$W$72,9,FALSE),\" \"))))))","v":0.30549999999999999},336050,{"$f":"IF($G19=\"User-defined Measure\",VLOOKUP($H19,Measures!$C$73:$W$77,12,FALSE),IF($D19=\"Hot & Humid\",VLOOKUP($H19,Measures!$C$6:$W$19,12,FALSE),IF($D19=\"Hot & Dry\",VLOOKUP($H19,Measures!$C$20:$W$32,12,FALSE),IF($D19=\"Marine\",VLOOKUP($H19,Measures!$C$33:$W$45,12,FALSE),IF($D19=\"Cold\",VLOOKUP($H19,Measures!$C$46:$W$58,12,FALSE),IF($D19=\"Very Cold\",VLOOKUP($H19,Measures!$C$59:$W$72,12,FALSE),\" \"))))))","v":0.18149999999999999},199650,1.6831955922865014,29.294123692344506,2]
[null,"Program B","Site 4","Hot & Humid",2200000,"FRCC All","Default","Standard Retrofit Package",0.15,"High",null,null,{"$f":"IF(F20<>0,VLOOKUP(F20,'Emission Factors'!$A$4:$J$31,7,FALSE),\" \")","v":1.7798078580435632E-2},{"$f":"IF($G20=\"User-defined Measure\",VLOOKUP($H20,Measures!$C$73:$W$77,16,FALSE),IF($D20=\"Hot & Humid\",VLOOKUP($H20,Measures!$C$6:$W$19,16,FALSE),IF($D20=\"Hot & Dry\",VLOOKUP($H20,Measures!$C$20:$W$32,16,FALSE),IF($D20=\"Marine\",VLOOKUP($H20,Measures!$C$33:$W$45,16,FALSE),IF($D20=\"Cold\",VLOOKUP($H20,Measures!$C$46:$W$58,16,FALSE),IF($D20=\"Very Cold\",VLOOKUP($H20,Measures!$C$59:$W$72,16,FALSE),\" \"))))))","v":15.353999999999999},{"$f":"IF($G20=\"User-defined Measure\",VLOOKUP($H20,Measures!$C$73:$W$77,19,FALSE),IF($D20=\"Hot & Humid\",VLOOKUP($H20,Measures!$C$6:$W$19,19,FALSE),IF($D20=\"Hot & Dry\",VLOOKUP($H20,Measures!$C$20:$W$32,19,FALSE),IF($D20=\"Marine\",VLOOKUP($H20,Measures!$C$33:$W$45,19,FALSE),IF($D20=\"Cold\",VLOOKUP($H20,Measures!$C$46:$W$58,19,FALSE),IF($D20=\"Very Cold\",VLOOKUP($H20,Measures!$C$59:$W$72,19,FALSE),\" \"))))))","v":14},29.353999999999999,9686820,90.179660512922851,{"$f":"IF(B20=0,\" \",PRODUCT(O20,'Emission Factors'!$J$36,E20,I20)/1000)","v":245.19264000000001},335.37230051292283,1.0162796985240086,{"$f":"IF($G20=\"User-defined Measure\",VLOOKUP($H20,Measures!$C$73:$X$77,22,FALSE),IF($D20=\"Hot & Humid\",VLOOKUP($H20,Measures!$C$6:$X$19,22,FALSE),IF($D20=\"Hot & Dry\",VLOOKUP($H20,Measures!$C$20:$X$32,22,FALSE),IF($D20=\"Marine\",VLOOKUP($H20,Measures!$C$33:$X$45,22,FALSE),IF($D20=\"Cold\",VLOOKUP($H20,Measures!$C$46:$X$58,22,FALSE),IF($D20=\"Very Cold\",VLOOKUP($H20,Measures!$C$59:$X$72,22,FALSE),\" \"))))))","v":20},6707.4460102584562,{"$f":"IF($G20=\"User-defined Measure\",VLOOKUP($H20,Measures!$C$73:$W$77,9,FALSE),IF($D20=\"Hot & Humid\",VLOOKUP($H20,Measures!$C$6:$W$19,9,FALSE),IF($D20=\"Hot & Dry\",VLOOKUP($H20,Measures!$C$20:$W$32,9,FALSE),IF($D20=\"Marine\",VLOOKUP($H20,Measures!$C$33:$W$45,9,FALSE),IF($D20=\"Cold\",VLOOKUP($H20,Measures!$C$46:$W$58,9,FALSE),IF($D20=\"Very Cold\",VLOOKUP($H20,Measures!$C$59:$W$72,9,FALSE),\" \"))))))","v":2.11},696300,{"$f":"IF($G20=\"User-defined Measure\",VLOOKUP($H20,Measures!$C$73:$W$77,12,FALSE),IF($D20=\"Hot & Humid\",VLOOKUP($H20,Measures!$C$6:$W$19,12,FALSE),IF($D20=\"Hot & Dry\",VLOOKUP($H20,Measures!$C$20:$W$32,12,FALSE),IF($D20=\"Marine\",VLOOKUP($H20,Measures!$C$33:$W$45,12,FALSE),IF($D20=\"Cold\",VLOOKUP($H20,Measures!$C$46:$W$58,12,FALSE),IF($D20=\"Very Cold\",VLOOKUP($H20,Measures!$C$59:$W$72,12,FALSE),\" \"))))))","v":0.68500000000000005},226050.00000000003,3.0802919708029193,103.81000442419807,6]
[null,"Program B","Site 4","Hot & Humid",2200000,"FRCC All","Default","Major Renovation (Deep Retrofit) Package",0.15,"Low",null,null,{"$f":"IF(F21<>0,VLOOKUP(F21,'Emission Factors'!$A$4:$J$31,7,FALSE),\" \")","v":1.7798078580435632E-2},{"$f":"IF($G21=\"User-defined Measure\",VLOOKUP($H21,Measures!$C$73:$W$77,16,FALSE),IF($D21=\"Hot & Humid\",VLOOKUP($H21,Measures!$C$6:$W$19,16,FALSE),IF($D21=\"Hot & Dry\",VLOOKUP($H21,Measures!$C$20:$W$32,16,FALSE),IF($D21=\"Marine\",VLOOKUP($H21,Measures!$C$33:$W$45,16,FALSE),IF($D21=\"Cold\",VLOOKUP($H21,Measures!$C$46:$W$58,16,FALSE),IF($D21=\"Very Cold\",VLOOKUP($H21,Measures!$C$59:$W$72,16,FALSE),\" \"))))))","v":25.931199999999997},{"$f":"IF($G21=\"User-defined Measure\",VLOOKUP($H21,Measures!$C$73:$W$77,19,FALSE),IF($D21=\"Hot & Humid\",VLOOKUP($H21,Measures!$C$6:$W$19,19,FALSE),IF($D21=\"Hot & Dry\",VLOOKUP($H21,Measures!$C$20:$W$32,19,FALSE),IF($D21=\"Marine\",VLOOKUP($H21,Measures!$C$33:$W$45,19,FALSE),IF($D21=\"Cold\",VLOOKUP($H21,Measures!$C$46:$W$58,19,FALSE),IF($D21=\"Very Cold\",VLOOKUP($H21,Measures!$C$59:$W$72,19,FALSE),\" \"))))))","v":14},39.931199999999997,13177296,152.30342664404748,{"$f":"IF(B21=0,\" \",PRODUCT(O21,'Emission Factors'!$J$36,E21,I21)/1000)","v":245.19264000000001},397.49606664404746,1.2045335352849924,{"$f":"IF($G21=\"User-defined Measure\",VLOOKUP($H21,Measures!$C$73:$X$77,22,FALSE),IF($D21=\"Hot & Humid\",VLOOKUP($H21,Measures!$C$6:$X$19,22,FALSE),IF($D21=\"Hot & Dry\",VLOOKUP($H21,Measures!$C$20:$X$32,22,FALSE),IF($D21=\"Marine\",VLOOKUP($H21,Measures!$C$33:$X$45,22,FALSE),IF($D21=\"Cold\",VLOOKUP($H21,Measures!$C$46:$X$58,22,FALSE),IF($D21=\"Very Cold\",VLOOKUP($H21,Measures!$C$59:$X$72,22,FALSE),\" \"))))))","v":20},7949.9213328809492,{"$f":"IF($G21=\"User-defined Measure\",VLOOKUP($H21,Measures!$C$73:$W$77,9,FALSE),IF($D21=\"Hot & Humid\",VLOOKUP($H21,Measures!$C$6:$W$19,9,FALSE),IF($D21=\"Hot & Dry\",VLOOKUP($H21,Measures!$C$20:$W$32,9,FALSE),IF($D21=\"Marine\",VLOOKUP($H21,Measures!$C$33:$W$45,9,FALSE),IF($D21=\"Cold\",VLOOKUP($H21,Measures!$C$46:$W$58,9,FALSE),IF($D21=\"Very Cold\",VLOOKUP($H21,Measures!$C$59:$W$72,9,FALSE),\" \"))))))","v":3.4849999999999999},1150050,{"$f":"IF($G21=\"User-defined Measure\",VLOOKUP($H21,Measures!$C$73:$W$77,12,FALSE),IF($D21=\"Hot & Humid\",VLOOKUP($H21,Measures!$C$6:$W$19,12,FALSE),IF($D21=\"Hot & Dry\",VLOOKUP($H21,Measures!$C$20:$W$32,12,FALSE),IF($D21=\"Marine\",VLOOKUP($H21,Measures!$C$33:$W$45,12,FALSE),IF($D21=\"Cold\",VLOOKUP($H21,Measures!$C$46:$W$58,12,FALSE),IF($D21=\"Very Cold\",VLOOKUP($H21,Measures!$C$59:$W$72,12,FALSE),\" \"))))))","v":0.58499999999999996},193050,5.9572649572649574,144.66180882109896,7]
[null,null,null,null,null,null,null,null,null,null,null,null,{"$f":"IF(F22<>0,VLOOKUP(F22,'Emission Factors'!$A$4:$J$31,7,FALSE),\" \")","v":" "},{"$f":"IF($G22=\"User-defined Measure\",VLOOKUP($H22,Measures!$C$73:$W$77,16,FALSE),IF($D22=\"Hot & Humid\",VLOOKUP($H22,Measures!$C$6:$W$19,16,FALSE),IF($D22=\"Hot & Dry\",VLOOKUP($H22,Measures!$C$20:$W$32,16,FALSE),IF($D22=\"Marine\",VLOOKUP($H22,Measures!$C$33:$W$45,16,FALSE),IF($D22=\"Cold\",VLOOKUP($H22,Measures!$C$46:$W$58,16,FALSE),IF($D22=\"Very Cold\",VLOOKUP($H22,Measures!$C$59:$W$72,16,FALSE),\" \"))))))","v":" "},{"$f":"IF($G22=\"User-defined Measure\",VLOOKUP($H22,Measures!$C$73:$W$77,19,FALSE),IF($D22=\"Hot & Humid\",VLOOKUP($H22,Measures!$C$6:$W$19,19,FALSE),IF($D22=\"Hot & Dry\",VLOOKUP($H22,Measures!$C$20:$W$32,19,FALSE),IF($D22=\"Marine\",VLOOKUP($H22,Measures!$C$33:$W$45,19,FALSE),IF($D22=\"Cold\",VLOOKUP($H22,Measures!$C$46:$W$58,19,FALSE),IF($D22=\"Very Cold\",VLOOKUP($H22,Measures!$C$59:$W$72,19,FALSE),\" \"))))))","v":" "}," "," "," ",{"$f":"IF(B22=0,\" \",PRODUCT(O22,'Emission Factors'!$J$36,E22,I22)/1000)","v":" "}," ","",{"$f":"IF($G22=\"User-defined Measure\",VLOOKUP($H22,Measures!$C$73:$X$77,22,FALSE),IF($D22=\"Hot & Humid\",VLOOKUP($H22,Measures!$C$6:$X$19,22,FALSE),IF($D22=\"Hot & Dry\",VLOOKUP($H22,Measures!$C$20:$X$32,22,FALSE),IF($D22=\"Marine\",VLOOKUP($H22,Measures!$C$33:$X$45,22,FALSE),IF($D22=\"Cold\",VLOOKUP($H22,Measures!$C$46:$X$58,22,FALSE),IF($D22=\"Very Cold\",VLOOKUP($H22,Measures!$C$59:$X$72,22,FALSE),\" \"))))))","v":" "}," ",{"$f":"IF($G22=\"User-defined Measure\",VLOOKUP($H22,Measures!$C$73:$W$77,9,FALSE),IF($D22=\"Hot & Humid\",VLOOKUP($H22,Measures!$C$6:$W$19,9,FALSE),IF($D22=\"Hot & Dry\",VLOOKUP($H22,Measures!$C$20:$W$32,9,FALSE),IF($D22=\"Marine\",VLOOKUP($H22,Measures!$C$33:$W$45,9,FALSE),IF($D22=\"Cold\",VLOOKUP($H22,Measures!$C$46:$W$58,9,FALSE),IF($D22=\"Very Cold\",VLOOKUP($H22,Measures!$C$59:$W$72,9,FALSE),\" \"))))))","v":" "}," ",{"$f":"IF($G22=\"User-defined Measure\",VLOOKUP($H22,Measures!$C$73:$W$77,12,FALSE),IF($D22=\"Hot & Humid\",VLOOKUP($H22,Measures!$C$6:$W$19,12,FALSE),IF($D22=\"Hot & Dry\",VLOOKUP($H22,Measures!$C$20:$W$32,12,FALSE),IF($D22=\"Marine\",VLOOKUP($H22,Measures!$C$33:$W$45,12,FALSE),IF($D22=\"Cold\",VLOOKUP($H22,Measures!$C$46:$W$58,12,FALSE),IF($D22=\"Very Cold\",VLOOKUP($H22,Measures!$C$59:$W$72,12,FALSE),\" \"))))))","v":" "}," "," "," "," "]
[null,null,null,null,null,null,null,null,null,null,null,null,{"$f":"IF(F23<>0,VLOOKUP(F23,'Emission Factors'!$A$4:$J$31,7,FALSE),\" \")","v":" "},{"$f":"IF($G23=\"User-defined Measure\",VLOOKUP($H23,Measures!$C$73:$W$77,16,FALSE),IF($D23=\"Hot & Humid\",VLOOKUP($H23,Measures!$C$6:$W$19,16,FALSE),IF($D23=\"Hot & Dry\",VLOOKUP($H23,Measures!$C$20:$W$32,16,FALSE),IF($D23=\"Marine\",VLOOKUP($H23,Measures!$C$33:$W$45,16,FALSE),IF($D23=\"Cold\",VLOOKUP($H23,Measures!$C$46:$W$58,16,FALSE),IF($D23=\"Very Cold\",VLOOKUP($H23,Measures!$C$59:$W$72,16,FALSE),\" \"))))))","v":" "},{"$f":"IF($G23=\"User-defined Measure\",VLOOKUP($H23,Measures!$C$73:$W$77,19,FALSE),IF($D23=\"Hot & Humid\",VLOOKUP($H23,Measures!$C$6:$W$19,19,FALSE),IF($D23=\"Hot & Dry\",VLOOKUP($H23,Measures!$C$20:$W$32,19,FALSE),IF($D23=\"Marine\",VLOOKUP($H23,Measures!$C$33:$W$45,19,FALSE),IF($D23=\"Cold\",VLOOKUP($H23,Measures!$C$46:$W$58,19,FALSE),IF($D23=\"Very Cold\",VLOOKUP($H23,Measures!$C$59:$W$72,19,FALSE),\" \"))))))","v":" "}," "," "," ",{"$f":"IF(B23=0,\" \",PRODUCT(O23,'Emission Factors'!$J$36,E23,I23)/1000)","v":" "}," ","",{"$f":"IF($G23=\"User-defined Measure\",VLOOKUP($H23,Measures!$C$73:$X$77,22,FALSE),IF($D23=\"Hot & Humid\",VLOOKUP($H23,Measures!$C$6:$X$19,22,FALSE),IF($D23=\"Hot & Dry\",VLOOKUP($H23,Measures!$C$20:$X$32,22,FALSE),IF($D23=\"Marine\",VLOOKUP($H23,Measures!$C$33:$X$45,22,FALSE),IF($D23=\"Cold\",VLOOKUP($H23,Measures!$C$46:$X$58,22,FALSE),IF($D23=\"Very Cold\",VLOOKUP($H23,Measures!$C$59:$X$72,22,FALSE),\" \"))))))","v":" "}," ",{"$f":"IF($G23=\"User-defined Measure\",VLOOKUP($H23,Measures!$C$73:$W$77,9,FALSE),IF($D23=\"Hot & Humid\",VLOOKUP($H23,Measures!$C$6:$W$19,9,FALSE),IF($D23=\"Hot & Dry\",VLOOKUP($H23,Measures!$C$20:$W$32,9,FALSE),IF($D23=\"Marine\",VLOOKUP($H23,Measures!$C$33:$W$45,9,FALSE),IF($D23=\"Cold\",VLOOKUP($H23,Measures!$C$46:$W$58,9,FALSE),IF($D23=\"Very Cold\",VLOOKUP($H23,Measures!$C$59:$W$72,9,FALSE),\" \"))))))","v":" "}," ",{"$f":"IF($G23=\"User-defined Measure\",VLOOKUP($H23,Measures!$C$73:$W$77,12,FALSE),IF($D23=\"Hot & Humid\",VLOOKUP($H23,Measures!$C$6:$W$19,12,FALSE),IF($D23=\"Hot & Dry\",VLOOKUP($H23,Measures!$C$20:$W$32,12,FALSE),IF($D23=\"Marine\",VLOOKUP($H23,Measures!$C$33:$W$45,12,FALSE),IF($D23=\"Cold\",VLOOKUP($H23,Measures!$C$46:$W$58,12,FALSE),IF($D23=\"Very Cold\",VLOOKUP($H23,Measures!$C$59:$W$72,12,FALSE),\" \"))))))","v":" "}," "," "," "," "]
[null,null,null,null,null,null,null,null,null,null,null,null,{"$f":"IF(F24<>0,VLOOKUP(F24,'Emission Factors'!$A$4:$J$31,7,FALSE),\" \")","v":" "},{"$f":"IF($G24=\"User-defined Measure\",VLOOKUP($H24,Measures!$C$73:$W$77,16,FALSE),IF($D24=\"Hot & Humid\",VLOOKUP($H24,Measures!$C$6:$W$19,16,FALSE),IF($D24=\"Hot & Dry\",VLOOKUP($H24,Measures!$C$20:$W$32,16,FALSE),IF($D24=\"Marine\",VLOOKUP($H24,Measures!$C$33:$W$45,16,FALSE),IF($D24=\"Cold\",VLOOKUP($H24,Measures!$C$46:$W$58,16,FALSE),IF($D24=\"Very Cold\",VLOOKUP($H24,Measures!$C$59:$W$72,16,FALSE),\" \"))))))","v":" "},{"$f":"IF($G24=\"User-defined Measure\",VLOOKUP($H24,Measures!$C$73:$W$77,19,FALSE),IF($D24=\"Hot & Humid\",VLOOKUP($H24,Measures!$C$6:$W$19,19,FALSE),IF($D24=\"Hot & Dry\",VLOOKUP($H24,Measures!$C$20:$W$32,19,FALSE),IF($D24=\"Marine\",VLOOKUP($H24,Measures!$C$33:$W$45,19,FALSE),IF($D24=\"Cold\",VLOOKUP($H24,Measures!$C$46:$W$58,19,FALSE),IF($D24=\"Very Cold\",VLOOKUP($H24,Measures!$C$59:$W$72,19,FALSE),\" \"))))))","v":" "}," "," "," ",{"$f":"IF(B24=0,\" \",PRODUCT(O24,'Emission Factors'!$J$36,E24,I24)/1000)","v":" "}," ","",{"$f":"IF($G24=\"User-defined Measure\",VLOOKUP($H24,Measures!$C$73:$X$77,22,FALSE),IF($D24=\"Hot & Humid\",VLOOKUP($H24,Measures!$C$6:$X$19,22,FALSE),IF($D24=\"Hot & Dry\",VLOOKUP($H24,Measures!$C$20:$X$32,22,FALSE),IF($D24=\"Marine\",VLOOKUP($H24,Measures!$C$33:$X$45,22,FALSE),IF($D24=\"Cold\",VLOOKUP($H24,Measures!$C$46:$X$58,22,FALSE),IF($D24=\"Very Cold\",VLOOKUP($H24,Measures!$C$59:$X$72,22,FALSE),\" \"))))))","v":" "}," ",{"$f":"IF($G24=\"User-defined Measure\",VLOOKUP($H24,Measures!$C$73:$W$77,9,FALSE),IF($D24=\"Hot & Humid\",VLOOKUP($H24,Measures!$C$6:$W$19,9,FALSE),IF($D24=\"Hot & Dry\",VLOOKUP($H24,Measures!$C$20:$W$32,9,FALSE),IF($D24=\"Marine\",VLOOKUP($H24,Measures!$C$33:$W$45,9,FALSE),IF($D24=\"Cold\",VLOOKUP($H24,Measures!$C$46:$W$58,9,FALSE),IF($D24=\"Very Cold\",VLOOKUP($H24,Measures!$C$59:$W$72,9,FALSE),\" \"))))))","v":" "}," ",{"$f":"IF($G24=\"User-defined Measure\",VLOOKUP($H24,Measures!$C$73:$W$77,12,FALSE),IF($D24=\"Hot & Humid\",VLOOKUP($H24,Measures!$C$6:$W$19,12,FALSE),IF($D24=\"Hot & Dry\",VLOOKUP($H24,Measures!$C$20:$W$32,12,FALSE),IF($D24=\"Marine\",VLOOKUP($H24,Measures!$C$33:$W$45,12,FALSE),IF($D24=\"Cold\",VLOOKUP($H24,Measures!$C$46:$W$58,12,FALSE),IF($D24=\"Very Cold\",VLOOKUP($H24,Measures!$C$59:$W$72,12,FALSE),\" \"))))))","v":" "}," "," "," "," "]
[null,null,null,null,null,null,null,null,null,null,null,null,{"$f":"IF(F25<>0,VLOOKUP(F25,'Emission Factors'!$A$4:$J$31,7,FALSE),\" \")","v":" "},{"$f":"IF($G25=\"User-defined Measure\",VLOOKUP($H25,Measures!$C$73:$W$77,16,FALSE),IF($D25=\"Hot & Humid\",VLOOKUP($H25,Measures!$C$6:$W$19,16,FALSE),IF($D25=\"Hot & Dry\",VLOOKUP($H25,Measures!$C$20:$W$32,16,FALSE),IF($D25=\"Marine\",VLOOKUP($H25,Measures!$C$33:$W$45,16,FALSE),IF($D25=\"Cold\",VLOOKUP($H25,Measures!$C$46:$W$58,16,FALSE),IF($D25=\"Very Cold\",VLOOKUP($H25,Measures!$C$59:$W$72,16,FALSE),\" \"))))))","v":" "},{"$f":"IF($G25=\"User-defined Measure\",VLOOKUP($H25,Measures!$C$73:$W$77,19,FALSE),IF($D25=\"Hot & Humid\",VLOOKUP($H25,Measures!$C$6:$W$19,19,FALSE),IF($D25=\"Hot & Dry\",VLOOKUP($H25,Measures!$C$20:$W$32,19,FALSE),IF($D25=\"Marine\",VLOOKUP($H25,Measures!$C$33:$W$45,19,FALSE),IF($D25=\"Cold\",VLOOKUP($H25,Measures!$C$46:$W$58,19,FALSE),IF($D25=\"Very Cold\",VLOOKUP($H25,Measures!$C$59:$W$72,19,FALSE),\" \"))))))","v":" "}," "," "," ",{"$f":"IF(B25=0,\" \",PRODUCT(O25,'Emission Factors'!$J$36,E25,I25)/1000)","v":" "}," ","",{"$f":"IF($G25=\"User-defined Measure\",VLOOKUP($H25,Measures!$C$73:$X$77,22,FALSE),IF($D25=\"Hot & Humid\",VLOOKUP($H25,Measures!$C$6:$X$19,22,FALSE),IF($D25=\"Hot & Dry\",VLOOKUP($H25,Measures!$C$20:$X$32,22,FALSE),IF($D25=\"Marine\",VLOOKUP($H25,Measures!$C$33:$X$45,22,FALSE),IF($D25=\"Cold\",VLOOKUP($H25,Measures!$C$46:$X$58,22,FALSE),IF($D25=\"Very Cold\",VLOOKUP($H25,Measures!$C$59:$X$72,22,FALSE),\" \"))))))","v":" "}," ",{"$f":"IF($G25=\"User-defined Measure\",VLOOKUP($H25,Measures!$C$73:$W$77,9,FALSE),IF($D25=\"Hot & Humid\",VLOOKUP($H25,Measures!$C$6:$W$19,9,FALSE),IF($D25=\"Hot & Dry\",VLOOKUP($H25,Measures!$C$20:$W$32,9,FALSE),IF($D25=\"Marine\",VLOOKUP($H25,Measures!$C$33:$W$45,9,FALSE),IF($D25=\"Cold\",VLOOKUP($H25,Measures!$C$46:$W$58,9,FALSE),IF($D25=\"Very Cold\",VLOOKUP($H25,Measures!$C$59:$W$72,9,FALSE),\" \"))))))","v":" "}," ",{"$f":"IF($G25=\"User-defined Measure\",VLOOKUP($H25,Measures!$C$73:$W$77,12,FALSE),IF($D25=\"Hot & Humid\",VLOOKUP($H25,Measures!$C$6:$W$19,12,FALSE),IF($D25=\"Hot & Dry\",VLOOKUP($H25,Measures!$C$20:$W$32,12,FALSE),IF($D25=\"Marine\",VLOOKUP($H25,Measures!$C$33:$W$45,12,FALSE),IF($D25=\"Cold\",VLOOKUP($H25,Measures!$C$46:$W$58,12,FALSE),IF($D25=\"Very Cold\",VLOOKUP($H25,Measures!$C$59:$W$72,12,FALSE),\" \"))))))","v":" "}," "," "," "," "]
[null,null,null,null,null,null,null,null,null,null,null,null,{"$f":"IF(F26<>0,VLOOKUP(F26,'Emission Factors'!$A$4:$J$31,7,FALSE),\" \")","v":" "},{"$f":"IF($G26=\"User-defined Measure\",VLOOKUP($H26,Measures!$C$73:$W$77,16,FALSE),IF($D26=\"Hot & Humid\",VLOOKUP($H26,Measures!$C$6:$W$19,16,FALSE),IF($D26=\"Hot & Dry\",VLOOKUP($H26,Measures!$C$20:$W$32,16,FALSE),IF($D26=\"Marine\",VLOOKUP($H26,Measures!$C$33:$W$45,16,FALSE),IF($D26=\"Cold\",VLOOKUP($H26,Measures!$C$46:$W$58,16,FALSE),IF($D26=\"Very Cold\",VLOOKUP($H26,Measures!$C$59:$W$72,16,FALSE),\" \"))))))","v":" "},{"$f":"IF($G26=\"User-defined Measure\",VLOOKUP($H26,Measures!$C$73:$W$77,19,FALSE),IF($D26=\"Hot & Humid\",VLOOKUP($H26,Measures!$C$6:$W$19,19,FALSE),IF($D26=\"Hot & Dry\",VLOOKUP($H26,Measures!$C$20:$W$32,19,FALSE),IF($D26=\"Marine\",VLOOKUP($H26,Measures!$C$33:$W$45,19,FALSE),IF($D26=\"Cold\",VLOOKUP($H26,Measures!$C$46:$W$58,19,FALSE),IF($D26=\"Very Cold\",VLOOKUP($H26,Measures!$C$59:$W$72,19,FALSE),\" \"))))))","v":" "}," "," "," ",{"$f":"IF(B26=0,\" \",PRODUCT(O26,'Emission Factors'!$J$36,E26,I26)/1000)","v":" "}," ","",{"$f":"IF($G26=\"User-defined Measure\",VLOOKUP($H26,Measures!$C$73:$X$77,22,FALSE),IF($D26=\"Hot & Humid\",VLOOKUP($H26,Measures!$C$6:$X$19,22,FALSE),IF($D26=\"Hot & Dry\",VLOOKUP($H26,Measures!$C$20:$X$32,22,FALSE),IF($D26=\"Marine\",VLOOKUP($H26,Measures!$C$33:$X$45,22,FALSE),IF($D26=\"Cold\",VLOOKUP($H26,Measures!$C$46:$X$58,22,FALSE),IF($D26=\"Very Cold\",VLOOKUP($H26,Measures!$C$59:$X$72,22,FALSE),\" \"))))))","v":" "}," ",{"$f":"IF($G26=\"User-defined Measure\",VLOOKUP($H26,Measures!$C$73:$W$77,9,FALSE),IF($D26=\"Hot & Humid\",VLOOKUP($H26,Measures!$C$6:$W$19,9,FALSE),IF($D26=\"Hot & Dry\",VLOOKUP($H26,Measures!$C$20:$W$32,9,FALSE),IF($D26=\"Marine\",VLOOKUP($H26,Measures!$C$33:$W$45,9,FALSE),IF($D26=\"Cold\",VLOOKUP($H26,Measures!$C$46:$W$58,9,FALSE),IF($D26=\"Very Cold\",VLOOKUP($H26,Measures!$C$59:$W$72,9,FALSE),\" \"))))))","v":" "}," ",{"$f":"IF($G26=\"User-defined Measure\",VLOOKUP($H26,Measures!$C$73:$W$77,12,FALSE),IF($D26=\"Hot & Humid\",VLOOKUP($H26,Measures!$C$6:$W$19,12,FALSE),IF($D26=\"Hot & Dry\",VLOOKUP($H26,Measures!$C$20:$W$32,12,FALSE),IF($D26=\"Marine\",VLOOKUP($H26,Measures!$C$33:$W$45,12,FALSE),IF($D26=\"Cold\",VLOOKUP($H26,Measures!$C$46:$W$58,12,FALSE),IF($D26=\"Very Cold\",VLOOKUP($H26,Measures!$C$59:$W$72,12,FALSE),\" \"))))))","v":" "}," "," "," "," "]
[null,null,null,null,null,null,null,null,null,null,null,null,{"$f":"IF(F27<>0,VLOOKUP(F27,'Emission Factors'!$A$4:$J$31,7,FALSE),\" \")","v":" "},{"$f":"IF($G27=\"User-defined Measure\",VLOOKUP($H27,Measures!$C$73:$W$77,16,FALSE),IF($D27=\"Hot & Humid\",VLOOKUP($H27,Measures!$C$6:$W$19,16,FALSE),IF($D27=\"Hot & Dry\",VLOOKUP($H27,Measures!$C$20:$W$32,16,FALSE),IF($D27=\"Marine\",VLOOKUP($H27,Measures!$C$33:$W$45,16,FALSE),IF($D27=\"Cold\",VLOOKUP($H27,Measures!$C$46:$W$58,16,FALSE),IF($D27=\"Very Cold\",VLOOKUP($H27,Measures!$C$59:$W$72,16,FALSE),\" \"))))))","v":" "},{"$f":"IF($G27=\"User-defined Measure\",VLOOKUP($H27,Measures!$C$73:$W$77,19,FALSE),IF($D27=\"Hot & Humid\",VLOOKUP($H27,Measures!$C$6:$W$19,19,FALSE),IF($D27=\"Hot & Dry\",VLOOKUP($H27,Measures!$C$20:$W$32,19,FALSE),IF($D27=\"Marine\",VLOOKUP($H27,Measures!$C$33:$W$45,19,FALSE),IF($D27=\"Cold\",VLOOKUP($H27,Measures!$C$46:$W$58,19,FALSE),IF($D27=\"Very Cold\",VLOOKUP($H27,Measures!$C$59:$W$72,19,FALSE),\" \"))))))","v":" "}," "," "," ",{"$f":"IF(B27=0,\" \",PRODUCT(O27,'Emission Factors'!$J$36,E27,I27)/1000)","v":" "}," ","",{"$f":"IF($G27=\"User-defined Measure\",VLOOKUP($H27,Measures!$C$73:$X$77,22,FALSE),IF($D27=\"Hot & Humid\",VLOOKUP($H27,Measures!$C$6:$X$19,22,FALSE),IF($D27=\"Hot & Dry\",VLOOKUP($H27,Measures!$C$20:$X$32,22,FALSE),IF($D27=\"Marine\",VLOOKUP($H27,Measures!$C$33:$X$45,22,FALSE),IF($D27=\"Cold\",VLOOKUP($H27,Measures!$C$46:$X$58,22,FALSE),IF($D27=\"Very Cold\",VLOOKUP($H27,Measures!$C$59:$X$72,22,FALSE),\" \"))))))","v":" "}," ",{"$f":"IF($G27=\"User-defined Measure\",VLOOKUP($H27,Measures!$C$73:$W$77,9,FALSE),IF($D27=\"Hot & Humid\",VLOOKUP($H27,Measures!$C$6:$W$19,9,FALSE),IF($D27=\"Hot & Dry\",VLOOKUP($H27,Measures!$C$20:$W$32,9,FALSE),IF($D27=\"Marine\",VLOOKUP($H27,Measures!$C$33:$W$45,9,FALSE),IF($D27=\"Cold\",VLOOKUP($H27,Measures!$C$46:$W$58,9,FALSE),IF($D27=\"Very Cold\",VLOOKUP($H27,Measures!$C$59:$W$72,9,FALSE),\" \"))))))","v":" "}," ",{"$f":"IF($G27=\"User-defined Measure\",VLOOKUP($H27,Measures!$C$73:$W$77,12,FALSE),IF($D27=\"Hot & Humid\",VLOOKUP($H27,Measures!$C$6:$W$19,12,FALSE),IF($D27=\"Hot & Dry\",VLOOKUP($H27,Measures!$C$20:$W$32,12,FALSE),IF($D27=\"Marine\",VLOOKUP($H27,Measures!$C$33:$W$45,12,FALSE),IF($D27=\"Cold\",VLOOKUP($H27,Measures!$C$46:$W$58,12,FALSE),IF($D27=\"Very Cold\",VLOOKUP($H27,Measures!$C$59:$W$72,12,FALSE),\" \"))))))","v":" "}," "," "," "," "]
[null,null,null,null,null,null,null,null,null,null,null,null,{"$f":"IF(F28<>0,VLOOKUP(F28,'Emission Factors'!$A$4:$J$31,7,FALSE),\" \")","v":" "},{"$f":"IF($G28=\"User-defined Measure\",VLOOKUP($H28,Measures!$C$73:$W$77,16,FALSE),IF($D28=\"Hot & Humid\",VLOOKUP($H28,Measures!$C$6:$W$19,16,FALSE),IF($D28=\"Hot & Dry\",VLOOKUP($H28,Measures!$C$20:$W$32,16,FALSE),IF($D28=\"Marine\",VLOOKUP($H28,Measures!$C$33:$W$45,16,FALSE),IF($D28=\"Cold\",VLOOKUP($H28,Measures!$C$46:$W$58,16,FALSE),IF($D28=\"Very Cold\",VLOOKUP($H28,Measures!$C$59:$W$72,16,FALSE),\" \"))))))","v":" "},{"$f":"IF($G28=\"User-defined Measure\",VLOOKUP($H28,Measures!$C$73:$W$77,19,FALSE),IF($D28=\"Hot & Humid\",VLOOKUP($H28,Measures!$C$6:$W$19,19,FALSE),IF($D28=\"Hot & Dry\",VLOOKUP($H28,Measures!$C$20:$W$32,19,FALSE),IF($D28=\"Marine\",VLOOKUP($H28,Measures!$C$33:$W$45,19,FALSE),IF($D28=\"Cold\",VLOOKUP($H28,Measures!$C$46:$W$58,19,FALSE),IF($D28=\"Very Cold\",VLOOKUP($H28,Measures!$C$59:$W$72,19,FALSE),\" \"))))))","v":" "}," "," "," ",{"$f":"IF(B28=0,\" \",PRODUCT(O28,'Emission Factors'!$J$36,E28,I28)/1000)","v":" "}," ","",{"$f":"IF($G28=\"User-defined Measure\",VLOOKUP($H28,Measures!$C$73:$X$77,22,FALSE),IF($D28=\"Hot & Humid\",VLOOKUP($H28,Measures!$C$6:$X$19,22,FALSE),IF($D28=\"Hot & Dry\",VLOOKUP($H28,Measures!$C$20:$X$32,22,FALSE),IF($D28=\"Marine\",VLOOKUP($H28,Measures!$C$33:$X$45,22,FALSE),IF($D28=\"Cold\",VLOOKUP($H28,Measures!$C$46:$X$58,22,FALSE),IF($D28=\"Very Cold\",VLOOKUP($H28,Measures!$C$59:$X$72,22,FALSE),\" \"))))))","v":" "}," ",{"$f":"IF($G28=\"User-defined Measure\",VLOOKUP($H28,Measures!$C$73:$W$77,9,FALSE),IF($D28=\"Hot & Humid\",VLOOKUP($H28,Measures!$C$6:$W$19,9,FALSE),IF($D28=\"Hot & Dry\",VLOOKUP($H28,Measures!$C$20:$W$32,9,FALSE),IF($D28=\"Marine\",VLOOKUP($H28,Measures!$C$33:$W$45,9,FALSE),IF($D28=\"Cold\",VLOOKUP($H28,Measures!$C$46:$W$58,9,FALSE),IF($D28=\"Very Cold\",VLOOKUP($H28,Measures!$C$59:$W$72,9,FALSE),\" \"))))))","v":" "}," ",{"$f":"IF($G28=\"User-defined Measure\",VLOOKUP($H28,Measures!$C$73:$W$77,12,FALSE),IF($D28=\"Hot & Humid\",VLOOKUP($H28,Measures!$C$6:$W$19,12,FALSE),IF($D28=\"Hot & Dry\",VLOOKUP($H28,Measures!$C$20:$W$32,12,FALSE),IF($D28=\"Marine\",VLOOKUP($H28,Measures!$C$33:$W$45,12,FALSE),IF($D28=\"Cold\",VLOOKUP($H28,Measures!$C$46:$W$58,12,FALSE),IF($D28=\"Very Cold\",VLOOKUP($H28,Measures!$C$59:$W$72,12,FALSE),\" \"))))))","v":" "}," "," "," "," "]
[null,null,null,null,null,null,null,null,null,null,null,null,{"$f":"IF(F29<>0,VLOOKUP(F29,'Emission Factors'!$A$4:$J$31,7,FALSE),\" \")","v":" "},{"$f":"IF($G29=\"User-defined Measure\",VLOOKUP($H29,Measures!$C$73:$W$77,16,FALSE),IF($D29=\"Hot & Humid\",VLOOKUP($H29,Measures!$C$6:$W$19,16,FALSE),IF($D29=\"Hot & Dry\",VLOOKUP($H29,Measures!$C$20:$W$32,16,FALSE),IF($D29=\"Marine\",VLOOKUP($H29,Measures!$C$33:$W$45,16,FALSE),IF($D29=\"Cold\",VLOOKUP($H29,Measures!$C$46:$W$58,16,FALSE),IF($D29=\"Very Cold\",VLOOKUP($H29,Measures!$C$59:$W$72,16,FALSE),\" \"))))))","v":" "},{"$f":"IF($G29=\"User-defined Measure\",VLOOKUP($H29,Measures!$C$73:$W$77,19,FALSE),IF($D29=\"Hot & Humid\",VLOOKUP($H29,Measures!$C$6:$W$19,19,FALSE),IF($D29=\"Hot & Dry\",VLOOKUP($H29,Measures!$C$20:$W$32,19,FALSE),IF($D29=\"Marine\",VLOOKUP($H29,Measures!$C$33:$W$45,19,FALSE),IF($D29=\"Cold\",VLOOKUP($H29,Measures!$C$46:$W$58,19,FALSE),IF($D29=\"Very Cold\",VLOOKUP($H29,Measures!$C$59:$W$72,19,FALSE),\" \"))))))","v":" "}," "," "," ",{"$f":"IF(B29=0,\" \",PRODUCT(O29,'Emission Factors'!$J$36,E29,I29)/1000)","v":" "}," ","",{"$f":"IF($G29=\"User-defined Measure\",VLOOKUP($H29,Measures!$C$73:$X$77,22,FALSE),IF($D29=\"Hot & Humid\",VLOOKUP($H29,Measures!$C$6:$X$19,22,FALSE),IF($D29=\"Hot & Dry\",VLOOKUP($H29,Measures!$C$20:$X$32,22,FALSE),IF($D29=\"Marine\",VLOOKUP($H29,Measures!$C$33:$X$45,22,FALSE),IF($D29=\"Cold\",VLOOKUP($H29,Measures!$C$46:$X$58,22,FALSE),IF($D29=\"Very Cold\",VLOOKUP($H29,Measures!$C$59:$X$72,22,FALSE),\" \"))))))","v":" "}," ",{"$f":"IF($G29=\"User-defined Measure\",VLOOKUP($H29,Measures!$C$73:$W$77,9,FALSE),IF($D29=\"Hot & Humid\",VLOOKUP($H29,Measures!$C$6:$W$19,9,FALSE),IF($D29=\"Hot & Dry\",VLOOKUP($H29,Measures!$C$20:$W$32,9,FALSE),IF($D29=\"Marine\",VLOOKUP($H29,Measures!$C$33:$W$45,9,FALSE),IF($D29=\"Cold\",VLOOKUP($H29,Measures!$C$46:$W$58,9,FALSE),IF($D29=\"Very Cold\",VLOOKUP($H29,Measures!$C$59:$W$72,9,FALSE),\" \"))))))","v":" "}," ",{"$f":"IF($G29=\"User-defined Measure\",VLOOKUP($H29,Measures!$C$73:$W$77,12,FALSE),IF($D29=\"Hot & Humid\",VLOOKUP($H29,Measures!$C$6:$W$19,12,FALSE),IF($D29=\"Hot & Dry\",VLOOKUP($H29,Measures!$C$20:$W$32,12,FALSE),IF($D29=\"Marine\",VLOOKUP($H29,Measures!$C$33:$W$45,12,FALSE),IF($D29=\"Cold\",VLOOKUP($H29,Measures!$C$46:$W$58,12,FALSE),IF($D29=\"Very Cold\",VLOOKUP($H29,Measures!$C$59:$W$72,12,FALSE),\" \"))))))","v":" "}," "," "," "," "]
[null,null,null,null,null,null,null,null,null,null,null,null,{"$f":"IF(F30<>0,VLOOKUP(F30,'Emission Factors'!$A$4:$J$31,7,FALSE),\" \")","v":" "},{"$f":"IF($G30=\"User-defined Measure\",VLOOKUP($H30,Measures!$C$73:$W$77,16,FALSE),IF($D30=\"Hot & Humid\",VLOOKUP($H30,Measures!$C$6:$W$19,16,FALSE),IF($D30=\"Hot & Dry\",VLOOKUP($H30,Measures!$C$20:$W$32,16,FALSE),IF($D30=\"Marine\",VLOOKUP($H30,Measures!$C$33:$W$45,16,FALSE),IF($D30=\"Cold\",VLOOKUP($H30,Measures!$C$46:$W$58,16,FALSE),IF($D30=\"Very Cold\",VLOOKUP($H30,Measures!$C$59:$W$72,16,FALSE),\" \"))))))","v":" "},{"$f":"IF($G30=\"User-defined Measure\",VLOOKUP($H30,Measures!$C$73:$W$77,19,FALSE),IF($D30=\"Hot & Humid\",VLOOKUP($H30,Measures!$C$6:$W$19,19,FALSE),IF($D30=\"Hot & Dry\",VLOOKUP($H30,Measures!$C$20:$W$32,19,FALSE),IF($D30=\"Marine\",VLOOKUP($H30,Measures!$C$33:$W$45,19,FALSE),IF($D30=\"Cold\",VLOOKUP($H30,Measures!$C$46:$W$58,19,FALSE),IF($D30=\"Very Cold\",VLOOKUP($H30,Measures!$C$59:$W$72,19,FALSE),\" \"))))))","v":" "}," "," "," ",{"$f":"IF(B30=0,\" \",PRODUCT(O30,'Emission Factors'!$J$36,E30,I30)/1000)","v":" "}," ","",{"$f":"IF($G30=\"User-defined Measure\",VLOOKUP($H30,Measures!$C$73:$X$77,22,FALSE),IF($D30=\"Hot & Humid\",VLOOKUP($H30,Measures!$C$6:$X$19,22,FALSE),IF($D30=\"Hot & Dry\",VLOOKUP($H30,Measures!$C$20:$X$32,22,FALSE),IF($D30=\"Marine\",VLOOKUP($H30,Measures!$C$33:$X$45,22,FALSE),IF($D30=\"Cold\",VLOOKUP($H30,Measures!$C$46:$X$58,22,FALSE),IF($D30=\"Very Cold\",VLOOKUP($H30,Measures!$C$59:$X$72,22,FALSE),\" \"))))))","v":" "}," ",{"$f":"IF($G30=\"User-defined Measure\",VLOOKUP($H30,Measures!$C$73:$W$77,9,FALSE),IF($D30=\"Hot & Humid\",VLOOKUP($H30,Measures!$C$6:$W$19,9,FALSE),IF($D30=\"Hot & Dry\",VLOOKUP($H30,Measures!$C$20:$W$32,9,FALSE),IF($D30=\"Marine\",VLOOKUP($H30,Measures!$C$33:$W$45,9,FALSE),IF($D30=\"Cold\",VLOOKUP($H30,Measures!$C$46:$W$58,9,FALSE),IF($D30=\"Very Cold\",VLOOKUP($H30,Measures!$C$59:$W$72,9,FALSE),\" \"))))))","v":" "}," ",{"$f":"IF($G30=\"User-defined Measure\",VLOOKUP($H30,Measures!$C$73:$W$77,12,FALSE),IF($D30=\"Hot & Humid\",VLOOKUP($H30,Measures!$C$6:$W$19,12,FALSE),IF($D30=\"Hot & Dry\",VLOOKUP($H30,Measures!$C$20:$W$32,12,FALSE),IF($D30=\"Marine\",VLOOKUP($H30,Measures!$C$33:$W$45,12,FALSE),IF($D30=\"Cold\",VLOOKUP($H30,Measures!$C$46:$W$58,12,FALSE),IF($D30=\"Very Cold\",VLOOKUP($H30,Measures!$C$59:$W$72,12,FALSE),\" \"))))))","v":" "}," "," "," "," "]
[null,null,null,null,null,null,null,null,null,null,null,null,{"$f":"IF(F31<>0,VLOOKUP(F31,'Emission Factors'!$A$4:$J$31,7,FALSE),\" \")","v":" "},{"$f":"IF($G31=\"User-defined Measure\",VLOOKUP($H31,Measures!$C$73:$W$77,16,FALSE),IF($D31=\"Hot & Humid\",VLOOKUP($H31,Measures!$C$6:$W$19,16,FALSE),IF($D31=\"Hot & Dry\",VLOOKUP($H31,Measures!$C$20:$W$32,16,FALSE),IF($D31=\"Marine\",VLOOKUP($H31,Measures!$C$33:$W$45,16,FALSE),IF($D31=\"Cold\",VLOOKUP($H31,Measures!$C$46:$W$58,16,FALSE),IF($D31=\"Very Cold\",VLOOKUP($H31,Measures!$C$59:$W$72,16,FALSE),\" \"))))))","v":" "},{"$f":"IF($G31=\"User-defined Measure\",VLOOKUP($H31,Measures!$C$73:$W$77,19,FALSE),IF($D31=\"Hot & Humid\",VLOOKUP($H31,Measures!$C$6:$W$19,19,FALSE),IF($D31=\"Hot & Dry\",VLOOKUP($H31,Measures!$C$20:$W$32,19,FALSE),IF($D31=\"Marine\",VLOOKUP($H31,Measures!$C$33:$W$45,19,FALSE),IF($D31=\"Cold\",VLOOKUP($H31,Measures!$C$46:$W$58,19,FALSE),IF($D31=\"Very Cold\",VLOOKUP($H31,Measures!$C$59:$W$72,19,FALSE),\" \"))))))","v":" "}," "," "," ",{"$f":"IF(B31=0,\" \",PRODUCT(O31,'Emission Factors'!$J$36,E31,I31)/1000)","v":" "}," ","",{"$f":"IF($G31=\"User-defined Measure\",VLOOKUP($H31,Measures!$C$73:$X$77,22,FALSE),IF($D31=\"Hot & Humid\",VLOOKUP($H31,Measures!$C$6:$X$19,22,FALSE),IF($D31=\"Hot & Dry\",VLOOKUP($H31,Measures!$C$20:$X$32,22,FALSE),IF($D31=\"Marine\",VLOOKUP($H31,Measures!$C$33:$X$45,22,FALSE),IF($D31=\"Cold\",VLOOKUP($H31,Measures!$C$46:$X$58,22,FALSE),IF($D31=\"Very Cold\",VLOOKUP($H31,Measures!$C$59:$X$72,22,FALSE),\" \"))))))","v":" "}," ",{"$f":"IF($G31=\"User-defined Measure\",VLOOKUP($H31,Measures!$C$73:$W$77,9,FALSE),IF($D31=\"Hot & Humid\",VLOOKUP($H31,Measures!$C$6:$W$19,9,FALSE),IF($D31=\"Hot & Dry\",VLOOKUP($H31,Measures!$C$20:$W$32,9,FALSE),IF($D31=\"Marine\",VLOOKUP($H31,Measures!$C$33:$W$45,9,FALSE),IF($D31=\"Cold\",VLOOKUP($H31,Measures!$C$46:$W$58,9,FALSE),IF($D31=\"Very Cold\",VLOOKUP($H31,Measures!$C$59:$W$72,9,FALSE),\" \"))))))","v":" "}," ",{"$f":"IF($G31=\"User-defined Measure\",VLOOKUP($H31,Measures!$C$73:$W$77,12,FALSE),IF($D31=\"Hot & Humid\",VLOOKUP($H31,Measures!$C$6:$W$19,12,FALSE),IF($D31=\"Hot & Dry\",VLOOKUP($H31,Measures!$C$20:$W$32,12,FALSE),IF($D31=\"Marine\",VLOOKUP($H31,Measures!$C$33:$W$45,12,FALSE),IF($D31=\"Cold\",VLOOKUP($H31,Measures!$C$46:$W$58,12,FALSE),IF($D31=\"Very Cold\",VLOOKUP($H31,Measures!$C$59:$W$72,12,FALSE),\" \"))))))","v":" "}," "," "," "," "]
[null,null,null,null,null,null,null,null,null,null,null,null,{"$f":"IF(F32<>0,VLOOKUP(F32,'Emission Factors'!$A$4:$J$31,7,FALSE),\" \")","v":" "},{"$f":"IF($G32=\"User-defined Measure\",VLOOKUP($H32,Measures!$C$73:$W$77,16,FALSE),IF($D32=\"Hot & Humid\",VLOOKUP($H32,Measures!$C$6:$W$19,16,FALSE),IF($D32=\"Hot & Dry\",VLOOKUP($H32,Measures!$C$20:$W$32,16,FALSE),IF($D32=\"Marine\",VLOOKUP($H32,Measures!$C$33:$W$45,16,FALSE),IF($D32=\"Cold\",VLOOKUP($H32,Measures!$C$46:$W$58,16,FALSE),IF($D32=\"Very Cold\",VLOOKUP($H32,Measures!$C$59:$W$72,16,FALSE),\" \"))))))","v":" "},{"$f":"IF($G32=\"User-defined Measure\",VLOOKUP($H32,Measures!$C$73:$W$77,19,FALSE),IF($D32=\"Hot & Humid\",VLOOKUP($H32,Measures!$C$6:$W$19,19,FALSE),IF($D32=\"Hot & Dry\",VLOOKUP($H32,Measures!$C$20:$W$32,19,FALSE),IF($D32=\"Marine\",VLOOKUP($H32,Measures!$C$33:$W$45,19,FALSE),IF($D32=\"Cold\",VLOOKUP($H32,Measures!$C$46:$W$58,19,FALSE),IF($D32=\"Very Cold\",VLOOKUP($H32,Measures!$C$59:$W$72,19,FALSE),\" \"))))))","v":" "}," "," "," ",{"$f":"IF(B32=0,\" \",PRODUCT(O32,'Emission Factors'!$J$36,E32,I32)/1000)","v":" "}," ","",{"$f":"IF($G32=\"User-defined Measure\",VLOOKUP($H32,Measures!$C$73:$X$77,22,FALSE),IF($D32=\"Hot & Humid\",VLOOKUP($H32,Measures!$C$6:$X$19,22,FALSE),IF($D32=\"Hot & Dry\",VLOOKUP($H32,Measures!$C$20:$X$32,22,FALSE),IF($D32=\"Marine\",VLOOKUP($H32,Measures!$C$33:$X$45,22,FALSE),IF($D32=\"Cold\",VLOOKUP($H32,Measures!$C$46:$X$58,22,FALSE),IF($D32=\"Very Cold\",VLOOKUP($H32,Measures!$C$59:$X$72,22,FALSE),\" \"))))))","v":" "}," ",{"$f":"IF($G32=\"User-defined Measure\",VLOOKUP($H32,Measures!$C$73:$W$77,9,FALSE),IF($D32=\"Hot & Humid\",VLOOKUP($H32,Measures!$C$6:$W$19,9,FALSE),IF($D32=\"Hot & Dry\",VLOOKUP($H32,Measures!$C$20:$W$32,9,FALSE),IF($D32=\"Marine\",VLOOKUP($H32,Measures!$C$33:$W$45,9,FALSE),IF($D32=\"Cold\",VLOOKUP($H32,Measures!$C$46:$W$58,9,FALSE),IF($D32=\"Very Cold\",VLOOKUP($H32,Measures!$C$59:$W$72,9,FALSE),\" \"))))))","v":" "}," ",{"$f":"IF($G32=\"User-defined Measure\",VLOOKUP($H32,Measures!$C$73:$W$77,12,FALSE),IF($D32=\"Hot & Humid\",VLOOKUP($H32,Measures!$C$6:$W$19,12,FALSE),IF($D32=\"Hot & Dry\",VLOOKUP($H32,Measures!$C$20:$W$32,12,FALSE),IF($D32=\"Marine\",VLOOKUP($H32,Measures!$C$33:$W$45,12,FALSE),IF($D32=\"Cold\",VLOOKUP($H32,Measures!$C$46:$W$58,12,FALSE),IF($D32=\"Very Cold\",VLOOKUP($H32,Measures!$C$59:$W$72,12,FALSE),\" \"))))))","v":" "}," "," "," "," "]
[null,null,null,null,null,null,null,null,null,null,null,null,{"$f":"IF(F33<>0,VLOOKUP(F33,'Emission Factors'!$A$4:$J$31,7,FALSE),\" \")","v":" "},{"$f":"IF($G33=\"User-defined Measure\",VLOOKUP($H33,Measures!$C$73:$W$77,16,FALSE),IF($D33=\"Hot & Humid\",VLOOKUP($H33,Measures!$C$6:$W$19,16,FALSE),IF($D33=\"Hot & Dry\",VLOOKUP($H33,Measures!$C$20:$W$32,16,FALSE),IF($D33=\"Marine\",VLOOKUP($H33,Measures!$C$33:$W$45,16,FALSE),IF($D33=\"Cold\",VLOOKUP($H33,Measures!$C$46:$W$58,16,FALSE),IF($D33=\"Very Cold\",VLOOKUP($H33,Measures!$C$59:$W$72,16,FALSE),\" \"))))))","v":" "},{"$f":"IF($G33=\"User-defined Measure\",VLOOKUP($H33,Measures!$C$73:$W$77,19,FALSE),IF($D33=\"Hot & Humid\",VLOOKUP($H33,Measures!$C$6:$W$19,19,FALSE),IF($D33=\"Hot & Dry\",VLOOKUP($H33,Measures!$C$20:$W$32,19,FALSE),IF($D33=\"Marine\",VLOOKUP($H33,Measures!$C$33:$W$45,19,FALSE),IF($D33=\"Cold\",VLOOKUP($H33,Measures!$C$46:$W$58,19,FALSE),IF($D33=\"Very Cold\",VLOOKUP($H33,Measures!$C$59:$W$72,19,FALSE),\" \"))))))","v":" "}," "," "," ",{"$f":"IF(B33=0,\" \",PRODUCT(O33,'Emission Factors'!$J$36,E33,I33)/1000)","v":" "}," ","",{"$f":"IF($G33=\"User-defined Measure\",VLOOKUP($H33,Measures!$C$73:$X$77,22,FALSE),IF($D33=\"Hot & Humid\",VLOOKUP($H33,Measures!$C$6:$X$19,22,FALSE),IF($D33=\"Hot & Dry\",VLOOKUP($H33,Measures!$C$20:$X$32,22,FALSE),IF($D33=\"Marine\",VLOOKUP($H33,Measures!$C$33:$X$45,22,FALSE),IF($D33=\"Cold\",VLOOKUP($H33,Measures!$C$46:$X$58,22,FALSE),IF($D33=\"Very Cold\",VLOOKUP($H33,Measures!$C$59:$X$72,22,FALSE),\" \"))))))","v":" "}," ",{"$f":"IF($G33=\"User-defined Measure\",VLOOKUP($H33,Measures!$C$73:$W$77,9,FALSE),IF($D33=\"Hot & Humid\",VLOOKUP($H33,Measures!$C$6:$W$19,9,FALSE),IF($D33=\"Hot & Dry\",VLOOKUP($H33,Measures!$C$20:$W$32,9,FALSE),IF($D33=\"Marine\",VLOOKUP($H33,Measures!$C$33:$W$45,9,FALSE),IF($D33=\"Cold\",VLOOKUP($H33,Measures!$C$46:$W$58,9,FALSE),IF($D33=\"Very Cold\",VLOOKUP($H33,Measures!$C$59:$W$72,9,FALSE),\" \"))))))","v":" "}," ",{"$f":"IF($G33=\"User-defined Measure\",VLOOKUP($H33,Measures!$C$73:$W$77,12,FALSE),IF($D33=\"Hot & Humid\",VLOOKUP($H33,Measures!$C$6:$W$19,12,FALSE),IF($D33=\"Hot & Dry\",VLOOKUP($H33,Measures!$C$20:$W$32,12,FALSE),IF($D33=\"Marine\",VLOOKUP($H33,Measures!$C$33:$W$45,12,FALSE),IF($D33=\"Cold\",VLOOKUP($H33,Measures!$C$46:$W$58,12,FALSE),IF($D33=\"Very Cold\",VLOOKUP($H33,Measures!$C$59:$W$72,12,FALSE),\" \"))))))","v":" "}," "," "," "," "]
[null,null,null,null,null,null,null,null,null,null,null,null,{"$f":"IF(F34<>0,VLOOKUP(F34,'Emission Factors'!$A$4:$J$31,7,FALSE),\" \")","v":" "},{"$f":"IF($G34=\"User-defined Measure\",VLOOKUP($H34,Measures!$C$73:$W$77,16,FALSE),IF($D34=\"Hot & Humid\",VLOOKUP($H34,Measures!$C$6:$W$19,16,FALSE),IF($D34=\"Hot & Dry\",VLOOKUP($H34,Measures!$C$20:$W$32,16,FALSE),IF($D34=\"Marine\",VLOOKUP($H34,Measures!$C$33:$W$45,16,FALSE),IF($D34=\"Cold\",VLOOKUP($H34,Measures!$C$46:$W$58,16,FALSE),IF($D34=\"Very Cold\",VLOOKUP($H34,Measures!$C$59:$W$72,16,FALSE),\" \"))))))","v":" "},{"$f":"IF($G34=\"User-defined Measure\",VLOOKUP($H34,Measures!$C$73:$W$77,19,FALSE),IF($D34=\"Hot & Humid\",VLOOKUP($H34,Measures!$C$6:$W$19,19,FALSE),IF($D34=\"Hot & Dry\",VLOOKUP($H34,Measures!$C$20:$W$32,19,FALSE),IF($D34=\"Marine\",VLOOKUP($H34,Measures!$C$33:$W$45,19,FALSE),IF($D34=\"Cold\",VLOOKUP($H34,Measures!$C$46:$W$58,19,FALSE),IF($D34=\"Very Cold\",VLOOKUP($H34,Measures!$C$59:$W$72,19,FALSE),\" \"))))))","v":" "}," "," "," ",{"$f":"IF(B34=0,\" \",PRODUCT(O34,'Emission Factors'!$J$36,E34,I34)/1000)","v":" "}," ","",{"$f":"IF($G34=\"User-defined Measure\",VLOOKUP($H34,Measures!$C$73:$X$77,22,FALSE),IF($D34=\"Hot & Humid\",VLOOKUP($H34,Measures!$C$6:$X$19,22,FALSE),IF($D34=\"Hot & Dry\",VLOOKUP($H34,Measures!$C$20:$X$32,22,FALSE),IF($D34=\"Marine\",VLOOKUP($H34,Measures!$C$33:$X$45,22,FALSE),IF($D34=\"Cold\",VLOOKUP($H34,Measures!$C$46:$X$58,22,FALSE),IF($D34=\"Very Cold\",VLOOKUP($H34,Measures!$C$59:$X$72,22,FALSE),\" \"))))))","v":" "}," ",{"$f":"IF($G34=\"User-defined Measure\",VLOOKUP($H34,Measures!$C$73:$W$77,9,FALSE),IF($D34=\"Hot & Humid\",VLOOKUP($H34,Measures!$C$6:$W$19,9,FALSE),IF($D34=\"Hot & Dry\",VLOOKUP($H34,Measures!$C$20:$W$32,9,FALSE),IF($D34=\"Marine\",VLOOKUP($H34,Measures!$C$33:$W$45,9,FALSE),IF($D34=\"Cold\",VLOOKUP($H34,Measures!$C$46:$W$58,9,FALSE),IF($D34=\"Very Cold\",VLOOKUP($H34,Measures!$C$59:$W$72,9,FALSE),\" \"))))))","v":" "}," ",{"$f":"IF($G34=\"User-defined Measure\",VLOOKUP($H34,Measures!$C$73:$W$77,12,FALSE),IF($D34=\"Hot & Humid\",VLOOKUP($H34,Measures!$C$6:$W$19,12,FALSE),IF($D34=\"Hot & Dry\",VLOOKUP($H34,Measures!$C$20:$W$32,12,FALSE),IF($D34=\"Marine\",VLOOKUP($H34,Measures!$C$33:$W$45,12,FALSE),IF($D34=\"Cold\",VLOOKUP($H34,Measures!$C$46:$W$58,12,FALSE),IF($D34=\"Very Cold\",VLOOKUP($H34,Measures!$C$59:$W$72,12,FALSE),\" \"))))))","v":" "}," "," "," "," "]
[null,null,null,null,null,null,null,null,null,null,null,null,{"$f":"IF(F35<>0,VLOOKUP(F35,'Emission Factors'!$A$4:$J$31,7,FALSE),\" \")","v":" "},{"$f":"IF($G35=\"User-defined Measure\",VLOOKUP($H35,Measures!$C$73:$W$77,16,FALSE),IF($D35=\"Hot & Humid\",VLOOKUP($H35,Measures!$C$6:$W$19,16,FALSE),IF($D35=\"Hot & Dry\",VLOOKUP($H35,Measures!$C$20:$W$32,16,FALSE),IF($D35=\"Marine\",VLOOKUP($H35,Measures!$C$33:$W$45,16,FALSE),IF($D35=\"Cold\",VLOOKUP($H35,Measures!$C$46:$W$58,16,FALSE),IF($D35=\"Very Cold\",VLOOKUP($H35,Measures!$C$59:$W$72,16,FALSE),\" \"))))))","v":" "},{"$f":"IF($G35=\"User-defined Measure\",VLOOKUP($H35,Measures!$C$73:$W$77,19,FALSE),IF($D35=\"Hot & Humid\",VLOOKUP($H35,Measures!$C$6:$W$19,19,FALSE),IF($D35=\"Hot & Dry\",VLOOKUP($H35,Measures!$C$20:$W$32,19,FALSE),IF($D35=\"Marine\",VLOOKUP($H35,Measures!$C$33:$W$45,19,FALSE),IF($D35=\"Cold\",VLOOKUP($H35,Measures!$C$46:$W$58,19,FALSE),IF($D35=\"Very Cold\",VLOOKUP($H35,Measures!$C$59:$W$72,19,FALSE),\" \"))))))","v":" "}," "," "," ",{"$f":"IF(B35=0,\" \",PRODUCT(O35,'Emission Factors'!$J$36,E35,I35)/1000)","v":" "}," ","",{"$f":"IF($G35=\"User-defined Measure\",VLOOKUP($H35,Measures!$C$73:$X$77,22,FALSE),IF($D35=\"Hot & Humid\",VLOOKUP($H35,Measures!$C$6:$X$19,22,FALSE),IF($D35=\"Hot & Dry\",VLOOKUP($H35,Measures!$C$20:$X$32,22,FALSE),IF($D35=\"Marine\",VLOOKUP($H35,Measures!$C$33:$X$45,22,FALSE),IF($D35=\"Cold\",VLOOKUP($H35,Measures!$C$46:$X$58,22,FALSE),IF($D35=\"Very Cold\",VLOOKUP($H35,Measures!$C$59:$X$72,22,FALSE),\" \"))))))","v":" "}," ",{"$f":"IF($G35=\"User-defined Measure\",VLOOKUP($H35,Measures!$C$73:$W$77,9,FALSE),IF($D35=\"Hot & Humid\",VLOOKUP($H35,Measures!$C$6:$W$19,9,FALSE),IF($D35=\"Hot & Dry\",VLOOKUP($H35,Measures!$C$20:$W$32,9,FALSE),IF($D35=\"Marine\",VLOOKUP($H35,Measures!$C$33:$W$45,9,FALSE),IF($D35=\"Cold\",VLOOKUP($H35,Measures!$C$46:$W$58,9,FALSE),IF($D35=\"Very Cold\",VLOOKUP($H35,Measures!$C$59:$W$72,9,FALSE),\" \"))))))","v":" "}," ",{"$f":"IF($G35=\"User-defined Measure\",VLOOKUP($H35,Measures!$C$73:$W$77,12,FALSE),IF($D35=\"Hot & Humid\",VLOOKUP($H35,Measures!$C$6:$W$19,12,FALSE),IF($D35=\"Hot & Dry\",VLOOKUP($H35,Measures!$C$20:$W$32,12,FALSE),IF($D35=\"Marine\",VLOOKUP($H35,Measures!$C$33:$W$45,12,FALSE),IF($D35=\"Cold\",VLOOKUP($H35,Measures!$C$46:$W$58,12,FALSE),IF($D35=\"Very Cold\",VLOOKUP($H35,Measures!$C$59:$W$72,12,FALSE),\" \"))))))","v":" "}," "," "," "," "]
[null,null,null,null,null,null,null,null,null,null,null,null,{"$f":"IF(F36<>0,VLOOKUP(F36,'Emission Factors'!$A$4:$J$31,7,FALSE),\" \")","v":" "},{"$f":"IF($G36=\"User-defined Measure\",VLOOKUP($H36,Measures!$C$73:$W$77,16,FALSE),IF($D36=\"Hot & Humid\",VLOOKUP($H36,Measures!$C$6:$W$19,16,FALSE),IF($D36=\"Hot & Dry\",VLOOKUP($H36,Measures!$C$20:$W$32,16,FALSE),IF($D36=\"Marine\",VLOOKUP($H36,Measures!$C$33:$W$45,16,FALSE),IF($D36=\"Cold\",VLOOKUP($H36,Measures!$C$46:$W$58,16,FALSE),IF($D36=\"Very Cold\",VLOOKUP($H36,Measures!$C$59:$W$72,16,FALSE),\" \"))))))","v":" "},{"$f":"IF($G36=\"User-defined Measure\",VLOOKUP($H36,Measures!$C$73:$W$77,19,FALSE),IF($D36=\"Hot & Humid\",VLOOKUP($H36,Measures!$C$6:$W$19,19,FALSE),IF($D36=\"Hot & Dry\",VLOOKUP($H36,Measures!$C$20:$W$32,19,FALSE),IF($D36=\"Marine\",VLOOKUP($H36,Measures!$C$33:$W$45,19,FALSE),IF($D36=\"Cold\",VLOOKUP($H36,Measures!$C$46:$W$58,19,FALSE),IF($D36=\"Very Cold\",VLOOKUP($H36,Measures!$C$59:$W$72,19,FALSE),\" \"))))))","v":" "}," "," "," ",{"$f":"IF(B36=0,\" \",PRODUCT(O36,'Emission Factors'!$J$36,E36,I36)/1000)","v":" "}," ","",{"$f":"IF($G36=\"User-defined Measure\",VLOOKUP($H36,Measures!$C$73:$X$77,22,FALSE),IF($D36=\"Hot & Humid\",VLOOKUP($H36,Measures!$C$6:$X$19,22,FALSE),IF($D36=\"Hot & Dry\",VLOOKUP($H36,Measures!$C$20:$X$32,22,FALSE),IF($D36=\"Marine\",VLOOKUP($H36,Measures!$C$33:$X$45,22,FALSE),IF($D36=\"Cold\",VLOOKUP($H36,Measures!$C$46:$X$58,22,FALSE),IF($D36=\"Very Cold\",VLOOKUP($H36,Measures!$C$59:$X$72,22,FALSE),\" \"))))))","v":" "}," ",{"$f":"IF($G36=\"User-defined Measure\",VLOOKUP($H36,Measures!$C$73:$W$77,9,FALSE),IF($D36=\"Hot & Humid\",VLOOKUP($H36,Measures!$C$6:$W$19,9,FALSE),IF($D36=\"Hot & Dry\",VLOOKUP($H36,Measures!$C$20:$W$32,9,FALSE),IF($D36=\"Marine\",VLOOKUP($H36,Measures!$C$33:$W$45,9,FALSE),IF($D36=\"Cold\",VLOOKUP($H36,Measures!$C$46:$W$58,9,FALSE),IF($D36=\"Very Cold\",VLOOKUP($H36,Measures!$C$59:$W$72,9,FALSE),\" \"))))))","v":" "}," ",{"$f":"IF($G36=\"User-defined Measure\",VLOOKUP($H36,Measures!$C$73:$W$77,12,FALSE),IF($D36=\"Hot & Humid\",VLOOKUP($H36,Measures!$C$6:$W$19,12,FALSE),IF($D36=\"Hot & Dry\",VLOOKUP($H36,Measures!$C$20:$W$32,12,FALSE),IF($D36=\"Marine\",VLOOKUP($H36,Measures!$C$33:$W$45,12,FALSE),IF($D36=\"Cold\",VLOOKUP($H36,Measures!$C$46:$W$58,12,FALSE),IF($D36=\"Very Cold\",VLOOKUP($H36,Measures!$C$59:$W$72,12,FALSE),\" \"))))))","v":" "}," "," "," "," "]
[null,null,null,null,null,null,null,null,null,null,null,null,{"$f":"IF(F37<>0,VLOOKUP(F37,'Emission Factors'!$A$4:$J$31,7,FALSE),\" \")","v":" "},{"$f":"IF($G37=\"User-defined Measure\",VLOOKUP($H37,Measures!$C$73:$W$77,16,FALSE),IF($D37=\"Hot & Humid\",VLOOKUP($H37,Measures!$C$6:$W$19,16,FALSE),IF($D37=\"Hot & Dry\",VLOOKUP($H37,Measures!$C$20:$W$32,16,FALSE),IF($D37=\"Marine\",VLOOKUP($H37,Measures!$C$33:$W$45,16,FALSE),IF($D37=\"Cold\",VLOOKUP($H37,Measures!$C$46:$W$58,16,FALSE),IF($D37=\"Very Cold\",VLOOKUP($H37,Measures!$C$59:$W$72,16,FALSE),\" \"))))))","v":" "},{"$f":"IF($G37=\"User-defined Measure\",VLOOKUP($H37,Measures!$C$73:$W$77,19,FALSE),IF($D37=\"Hot & Humid\",VLOOKUP($H37,Measures!$C$6:$W$19,19,FALSE),IF($D37=\"Hot & Dry\",VLOOKUP($H37,Measures!$C$20:$W$32,19,FALSE),IF($D37=\"Marine\",VLOOKUP($H37,Measures!$C$33:$W$45,19,FALSE),IF($D37=\"Cold\",VLOOKUP($H37,Measures!$C$46:$W$58,19,FALSE),IF($D37=\"Very Cold\",VLOOKUP($H37,Measures!$C$59:$W$72,19,FALSE),\" \"))))))","v":" "}," "," "," ",{"$f":"IF(B37=0,\" \",PRODUCT(O37,'Emission Factors'!$J$36,E37,I37)/1000)","v":" "}," ","",{"$f":"IF($G37=\"User-defined Measure\",VLOOKUP($H37,Measures!$C$73:$X$77,22,FALSE),IF($D37=\"Hot & Humid\",VLOOKUP($H37,Measures!$C$6:$X$19,22,FALSE),IF($D37=\"Hot & Dry\",VLOOKUP($H37,Measures!$C$20:$X$32,22,FALSE),IF($D37=\"Marine\",VLOOKUP($H37,Measures!$C$33:$X$45,22,FALSE),IF($D37=\"Cold\",VLOOKUP($H37,Measures!$C$46:$X$58,22,FALSE),IF($D37=\"Very Cold\",VLOOKUP($H37,Measures!$C$59:$X$72,22,FALSE),\" \"))))))","v":" "}," ",{"$f":"IF($G37=\"User-defined Measure\",VLOOKUP($H37,Measures!$C$73:$W$77,9,FALSE),IF($D37=\"Hot & Humid\",VLOOKUP($H37,Measures!$C$6:$W$19,9,FALSE),IF($D37=\"Hot & Dry\",VLOOKUP($H37,Measures!$C$20:$W$32,9,FALSE),IF($D37=\"Marine\",VLOOKUP($H37,Measures!$C$33:$W$45,9,FALSE),IF($D37=\"Cold\",VLOOKUP($H37,Measures!$C$46:$W$58,9,FALSE),IF($D37=\"Very Cold\",VLOOKUP($H37,Measures!$C$59:$W$72,9,FALSE),\" \"))))))","v":" "}," ",{"$f":"IF($G37=\"User-defined Measure\",VLOOKUP($H37,Measures!$C$73:$W$77,12,FALSE),IF($D37=\"Hot & Humid\",VLOOKUP($H37,Measures!$C$6:$W$19,12,FALSE),IF($D37=\"Hot & Dry\",VLOOKUP($H37,Measures!$C$20:$W$32,12,FALSE),IF($D37=\"Marine\",VLOOKUP($H37,Measures!$C$33:$W$45,12,FALSE),IF($D37=\"Cold\",VLOOKUP($H37,Measures!$C$46:$W$58,12,FALSE),IF($D37=\"Very Cold\",VLOOKUP($H37,Measures!$C$59:$W$72,12,FALSE),\" \"))))))","v":" "}," "," "," "," "]
[null,null,null,null,null,null,null,null,null,null,null,null,{"$f":"IF(F38<>0,VLOOKUP(F38,'Emission Factors'!$A$4:$J$31,7,FALSE),\" \")","v":" "},{"$f":"IF($G38=\"User-defined Measure\",VLOOKUP($H38,Measures!$C$73:$W$77,16,FALSE),IF($D38=\"Hot & Humid\",VLOOKUP($H38,Measures!$C$6:$W$19,16,FALSE),IF($D38=\"Hot & Dry\",VLOOKUP($H38,Measures!$C$20:$W$32,16,FALSE),IF($D38=\"Marine\",VLOOKUP($H38,Measures!$C$33:$W$45,16,FALSE),IF($D38=\"Cold\",VLOOKUP($H38,Measures!$C$46:$W$58,16,FALSE),IF($D38=\"Very Cold\",VLOOKUP($H38,Measures!$C$59:$W$72,16,FALSE),\" \"))))))","v":" "},{"$f":"IF($G38=\"User-defined Measure\",VLOOKUP($H38,Measures!$C$73:$W$77,19,FALSE),IF($D38=\"Hot & Humid\",VLOOKUP($H38,Measures!$C$6:$W$19,19,FALSE),IF($D38=\"Hot & Dry\",VLOOKUP($H38,Measures!$C$20:$W$32,19,FALSE),IF($D38=\"Marine\",VLOOKUP($H38,Measures!$C$33:$W$45,19,FALSE),IF($D38=\"Cold\",VLOOKUP($H38,Measures!$C$46:$W$58,19,FALSE),IF($D38=\"Very Cold\",VLOOKUP($H38,Measures!$C$59:$W$72,19,FALSE),\" \"))))))","v":" "}," "," "," ",{"$f":"IF(B38=0,\" \",PRODUCT(O38,'Emission Factors'!$J$36,E38,I38)/1000)","v":" "}," ","",{"$f":"IF($G38=\"User-defined Measure\",VLOOKUP($H38,Measures!$C$73:$X$77,22,FALSE),IF($D38=\"Hot & Humid\",VLOOKUP($H38,Measures!$C$6:$X$19,22,FALSE),IF($D38=\"Hot & Dry\",VLOOKUP($H38,Measures!$C$20:$X$32,22,FALSE),IF($D38=\"Marine\",VLOOKUP($H38,Measures!$C$33:$X$45,22,FALSE),IF($D38=\"Cold\",VLOOKUP($H38,Measures!$C$46:$X$58,22,FALSE),IF($D38=\"Very Cold\",VLOOKUP($H38,Measures!$C$59:$X$72,22,FALSE),\" \"))))))","v":" "}," ",{"$f":"IF($G38=\"User-defined Measure\",VLOOKUP($H38,Measures!$C$73:$W$77,9,FALSE),IF($D38=\"Hot & Humid\",VLOOKUP($H38,Measures!$C$6:$W$19,9,FALSE),IF($D38=\"Hot & Dry\",VLOOKUP($H38,Measures!$C$20:$W$32,9,FALSE),IF($D38=\"Marine\",VLOOKUP($H38,Measures!$C$33:$W$45,9,FALSE),IF($D38=\"Cold\",VLOOKUP($H38,Measures!$C$46:$W$58,9,FALSE),IF($D38=\"Very Cold\",VLOOKUP($H38,Measures!$C$59:$W$72,9,FALSE),\" \"))))))","v":" "}," ",{"$f":"IF($G38=\"User-defined Measure\",VLOOKUP($H38,Measures!$C$73:$W$77,12,FALSE),IF($D38=\"Hot & Humid\",VLOOKUP($H38,Measures!$C$6:$W$19,12,FALSE),IF($D38=\"Hot & Dry\",VLOOKUP($H38,Measures!$C$20:$W$32,12,FALSE),IF($D38=\"Marine\",VLOOKUP($H38,Measures!$C$33:$W$45,12,FALSE),IF($D38=\"Cold\",VLOOKUP($H38,Measures!$C$46:$W$58,12,FALSE),IF($D38=\"Very Cold\",VLOOKUP($H38,Measures!$C$59:$W$72,12,FALSE),\" \"))))))","v":" "}," "," "," "," "]
[null,null,null,null,null,null,null,null,null,null,null,null,{"$f":"IF(F39<>0,VLOOKUP(F39,'Emission Factors'!$A$4:$J$31,7,FALSE),\" \")","v":" "},{"$f":"IF($G39=\"User-defined Measure\",VLOOKUP($H39,Measures!$C$73:$W$77,16,FALSE),IF($D39=\"Hot & Humid\",VLOOKUP($H39,Measures!$C$6:$W$19,16,FALSE),IF($D39=\"Hot & Dry\",VLOOKUP($H39,Measures!$C$20:$W$32,16,FALSE),IF($D39=\"Marine\",VLOOKUP($H39,Measures!$C$33:$W$45,16,FALSE),IF($D39=\"Cold\",VLOOKUP($H39,Measures!$C$46:$W$58,16,FALSE),IF($D39=\"Very Cold\",VLOOKUP($H39,Measures!$C$59:$W$72,16,FALSE),\" \"))))))","v":" "},{"$f":"IF($G39=\"User-defined Measure\",VLOOKUP($H39,Measures!$C$73:$W$77,19,FALSE),IF($D39=\"Hot & Humid\",VLOOKUP($H39,Measures!$C$6:$W$19,19,FALSE),IF($D39=\"Hot & Dry\",VLOOKUP($H39,Measures!$C$20:$W$32,19,FALSE),IF($D39=\"Marine\",VLOOKUP($H39,Measures!$C$33:$W$45,19,FALSE),IF($D39=\"Cold\",VLOOKUP($H39,Measures!$C$46:$W$58,19,FALSE),IF($D39=\"Very Cold\",VLOOKUP($H39,Measures!$C$59:$W$72,19,FALSE),\" \"))))))","v":" "}," "," "," ",{"$f":"IF(B39=0,\" \",PRODUCT(O39,'Emission Factors'!$J$36,E39,I39)/1000)","v":" "}," ","",{"$f":"IF($G39=\"User-defined Measure\",VLOOKUP($H39,Measures!$C$73:$X$77,22,FALSE),IF($D39=\"Hot & Humid\",VLOOKUP($H39,Measures!$C$6:$X$19,22,FALSE),IF($D39=\"Hot & Dry\",VLOOKUP($H39,Measures!$C$20:$X$32,22,FALSE),IF($D39=\"Marine\",VLOOKUP($H39,Measures!$C$33:$X$45,22,FALSE),IF($D39=\"Cold\",VLOOKUP($H39,Measures!$C$46:$X$58,22,FALSE),IF($D39=\"Very Cold\",VLOOKUP($H39,Measures!$C$59:$X$72,22,FALSE),\" \"))))))","v":" "}," ",{"$f":"IF($G39=\"User-defined Measure\",VLOOKUP($H39,Measures!$C$73:$W$77,9,FALSE),IF($D39=\"Hot & Humid\",VLOOKUP($H39,Measures!$C$6:$W$19,9,FALSE),IF($D39=\"Hot & Dry\",VLOOKUP($H39,Measures!$C$20:$W$32,9,FALSE),IF($D39=\"Marine\",VLOOKUP($H39,Measures!$C$33:$W$45,9,FALSE),IF($D39=\"Cold\",VLOOKUP($H39,Measures!$C$46:$W$58,9,FALSE),IF($D39=\"Very Cold\",VLOOKUP($H39,Measures!$C$59:$W$72,9,FALSE),\" \"))))))","v":" "}," ",{"$f":"IF($G39=\"User-defined Measure\",VLOOKUP($H39,Measures!$C$73:$W$77,12,FALSE),IF($D39=\"Hot & Humid\",VLOOKUP($H39,Measures!$C$6:$W$19,12,FALSE),IF($D39=\"Hot & Dry\",VLOOKUP($H39,Measures!$C$20:$W$32,12,FALSE),IF($D39=\"Marine\",VLOOKUP($H39,Measures!$C$33:$W$45,12,FALSE),IF($D39=\"Cold\",VLOOKUP($H39,Measures!$C$46:$W$58,12,FALSE),IF($D39=\"Very Cold\",VLOOKUP($H39,Measures!$C$59:$W$72,12,FALSE),\" \"))))))","v":" "}," "," "," "," "]
[null,null,null,null,null,null,null,null,null,null,null,null,{"$f":"IF(F40<>0,VLOOKUP(F40,'Emission Factors'!$A$4:$J$31,7,FALSE),\" \")","v":" "},{"$f":"IF($G40=\"User-defined Measure\",VLOOKUP($H40,Measures!$C$73:$W$77,16,FALSE),IF($D40=\"Hot & Humid\",VLOOKUP($H40,Measures!$C$6:$W$19,16,FALSE),IF($D40=\"Hot & Dry\",VLOOKUP($H40,Measures!$C$20:$W$32,16,FALSE),IF($D40=\"Marine\",VLOOKUP($H40,Measures!$C$33:$W$45,16,FALSE),IF($D40=\"Cold\",VLOOKUP($H40,Measures!$C$46:$W$58,16,FALSE),IF($D40=\"Very Cold\",VLOOKUP($H40,Measures!$C$59:$W$72,16,FALSE),\" \"))))))","v":" "},{"$f":"IF($G40=\"User-defined Measure\",VLOOKUP($H40,Measures!$C$73:$W$77,19,FALSE),IF($D40=\"Hot & Humid\",VLOOKUP($H40,Measures!$C$6:$W$19,19,FALSE),IF($D40=\"Hot & Dry\",VLOOKUP($H40,Measures!$C$20:$W$32,19,FALSE),IF($D40=\"Marine\",VLOOKUP($H40,Measures!$C$33:$W$45,19,FALSE),IF($D40=\"Cold\",VLOOKUP($H40,Measures!$C$46:$W$58,19,FALSE),IF($D40=\"Very Cold\",VLOOKUP($H40,Measures!$C$59:$W$72,19,FALSE),\" \"))))))","v":" "}," "," "," ",{"$f":"IF(B40=0,\" \",PRODUCT(O40,'Emission Factors'!$J$36,E40,I40)/1000)","v":" "}," ","",{"$f":"IF($G40=\"User-defined Measure\",VLOOKUP($H40,Measures!$C$73:$X$77,22,FALSE),IF($D40=\"Hot & Humid\",VLOOKUP($H40,Measures!$C$6:$X$19,22,FALSE),IF($D40=\"Hot & Dry\",VLOOKUP($H40,Measures!$C$20:$X$32,22,FALSE),IF($D40=\"Marine\",VLOOKUP($H40,Measures!$C$33:$X$45,22,FALSE),IF($D40=\"Cold\",VLOOKUP($H40,Measures!$C$46:$X$58,22,FALSE),IF($D40=\"Very Cold\",VLOOKUP($H40,Measures!$C$59:$X$72,22,FALSE),\" \"))))))","v":" "}," ",{"$f":"IF($G40=\"User-defined Measure\",VLOOKUP($H40,Measures!$C$73:$W$77,9,FALSE),IF($D40=\"Hot & Humid\",VLOOKUP($H40,Measures!$C$6:$W$19,9,FALSE),IF($D40=\"Hot & Dry\",VLOOKUP($H40,Measures!$C$20:$W$32,9,FALSE),IF($D40=\"Marine\",VLOOKUP($H40,Measures!$C$33:$W$45,9,FALSE),IF($D40=\"Cold\",VLOOKUP($H40,Measures!$C$46:$W$58,9,FALSE),IF($D40=\"Very Cold\",VLOOKUP($H40,Measures!$C$59:$W$72,9,FALSE),\" \"))))))","v":" "}," ",{"$f":"IF($G40=\"User-defined Measure\",VLOOKUP($H40,Measures!$C$73:$W$77,12,FALSE),IF($D40=\"Hot & Humid\",VLOOKUP($H40,Measures!$C$6:$W$19,12,FALSE),IF($D40=\"Hot & Dry\",VLOOKUP($H40,Measures!$C$20:$W$32,12,FALSE),IF($D40=\"Marine\",VLOOKUP($H40,Measures!$C$33:$W$45,12,FALSE),IF($D40=\"Cold\",VLOOKUP($H40,Measures!$C$46:$W$58,12,FALSE),IF($D40=\"Very Cold\",VLOOKUP($H40,Measures!$C$59:$W$72,12,FALSE),\" \"))))))","v":" "}," "," "," "," "]
[null,null,null,null,null,null,null,null,null,null,null,null,{"$f":"IF(F41<>0,VLOOKUP(F41,'Emission Factors'!$A$4:$J$31,7,FALSE),\" \")","v":" "},{"$f":"IF($G41=\"User-defined Measure\",VLOOKUP($H41,Measures!$C$73:$W$77,16,FALSE),IF($D41=\"Hot & Humid\",VLOOKUP($H41,Measures!$C$6:$W$19,16,FALSE),IF($D41=\"Hot & Dry\",VLOOKUP($H41,Measures!$C$20:$W$32,16,FALSE),IF($D41=\"Marine\",VLOOKUP($H41,Measures!$C$33:$W$45,16,FALSE),IF($D41=\"Cold\",VLOOKUP($H41,Measures!$C$46:$W$58,16,FALSE),IF($D41=\"Very Cold\",VLOOKUP($H41,Measures!$C$59:$W$72,16,FALSE),\" \"))))))","v":" "},{"$f":"IF($G41=\"User-defined Measure\",VLOOKUP($H41,Measures!$C$73:$W$77,19,FALSE),IF($D41=\"Hot & Humid\",VLOOKUP($H41,Measures!$C$6:$W$19,19,FALSE),IF($D41=\"Hot & Dry\",VLOOKUP($H41,Measures!$C$20:$W$32,19,FALSE),IF($D41=\"Marine\",VLOOKUP($H41,Measures!$C$33:$W$45,19,FALSE),IF($D41=\"Cold\",VLOOKUP($H41,Measures!$C$46:$W$58,19,FALSE),IF($D41=\"Very Cold\",VLOOKUP($H41,Measures!$C$59:$W$72,19,FALSE),\" \"))))))","v":" "}," "," "," ",{"$f":"IF(B41=0,\" \",PRODUCT(O41,'Emission Factors'!$J$36,E41,I41)/1000)","v":" "}," ","",{"$f":"IF($G41=\"User-defined Measure\",VLOOKUP($H41,Measures!$C$73:$X$77,22,FALSE),IF($D41=\"Hot & Humid\",VLOOKUP($H41,Measures!$C$6:$X$19,22,FALSE),IF($D41=\"Hot & Dry\",VLOOKUP($H41,Measures!$C$20:$X$32,22,FALSE),IF($D41=\"Marine\",VLOOKUP($H41,Measures!$C$33:$X$45,22,FALSE),IF($D41=\"Cold\",VLOOKUP($H41,Measures!$C$46:$X$58,22,FALSE),IF($D41=\"Very Cold\",VLOOKUP($H41,Measures!$C$59:$X$72,22,FALSE),\" \"))))))","v":" "}," ",{"$f":"IF($G41=\"User-defined Measure\",VLOOKUP($H41,Measures!$C$73:$W$77,9,FALSE),IF($D41=\"Hot & Humid\",VLOOKUP($H41,Measures!$C$6:$W$19,9,FALSE),IF($D41=\"Hot & Dry\",VLOOKUP($H41,Measures!$C$20:$W$32,9,FALSE),IF($D41=\"Marine\",VLOOKUP($H41,Measures!$C$33:$W$45,9,FALSE),IF($D41=\"Cold\",VLOOKUP($H41,Measures!$C$46:$W$58,9,FALSE),IF($D41=\"Very Cold\",VLOOKUP($H41,Measures!$C$59:$W$72,9,FALSE),\" \"))))))","v":" "}," ",{"$f":"IF($G41=\"User-defined Measure\",VLOOKUP($H41,Measures!$C$73:$W$77,12,FALSE),IF($D41=\"Hot & Humid\",VLOOKUP($H41,Measures!$C$6:$W$19,12,FALSE),IF($D41=\"Hot & Dry\",VLOOKUP($H41,Measures!$C$20:$W$32,12,FALSE),IF($D41=\"Marine\",VLOOKUP($H41,Measures!$C$33:$W$45,12,FALSE),IF($D41=\"Cold\",VLOOKUP($H41,Measures!$C$46:$W$58,12,FALSE),IF($D41=\"Very Cold\",VLOOKUP($H41,Measures!$C$59:$W$72,12,FALSE),\" \"))))))","v":" "}," "," "," "," "]
[null,null,null,null,null,null,null,null,null,null,null,null,{"$f":"IF(F42<>0,VLOOKUP(F42,'Emission Factors'!$A$4:$J$31,7,FALSE),\" \")","v":" "},{"$f":"IF($G42=\"User-defined Measure\",VLOOKUP($H42,Measures!$C$73:$W$77,16,FALSE),IF($D42=\"Hot & Humid\",VLOOKUP($H42,Measures!$C$6:$W$19,16,FALSE),IF($D42=\"Hot & Dry\",VLOOKUP($H42,Measures!$C$20:$W$32,16,FALSE),IF($D42=\"Marine\",VLOOKUP($H42,Measures!$C$33:$W$45,16,FALSE),IF($D42=\"Cold\",VLOOKUP($H42,Measures!$C$46:$W$58,16,FALSE),IF($D42=\"Very Cold\",VLOOKUP($H42,Measures!$C$59:$W$72,16,FALSE),\" \"))))))","v":" "},{"$f":"IF($G42=\"User-defined Measure\",VLOOKUP($H42,Measures!$C$73:$W$77,19,FALSE),IF($D42=\"Hot & Humid\",VLOOKUP($H42,Measures!$C$6:$W$19,19,FALSE),IF($D42=\"Hot & Dry\",VLOOKUP($H42,Measures!$C$20:$W$32,19,FALSE),IF($D42=\"Marine\",VLOOKUP($H42,Measures!$C$33:$W$45,19,FALSE),IF($D42=\"Cold\",VLOOKUP($H42,Measures!$C$46:$W$58,19,FALSE),IF($D42=\"Very Cold\",VLOOKUP($H42,Measures!$C$59:$W$72,19,FALSE),\" \"))))))","v":" "}," "," "," ",{"$f":"IF(B42=0,\" \",PRODUCT(O42,'Emission Factors'!$J$36,E42,I42)/1000)","v":" "}," ","",{"$f":"IF($G42=\"User-defined Measure\",VLOOKUP($H42,Measures!$C$73:$X$77,22,FALSE),IF($D42=\"Hot & Humid\",VLOOKUP($H42,Measures!$C$6:$X$19,22,FALSE),IF($D42=\"Hot & Dry\",VLOOKUP($H42,Measures!$C$20:$X$32,22,FALSE),IF($D42=\"Marine\",VLOOKUP($H42,Measures!$C$33:$X$45,22,FALSE),IF($D42=\"Cold\",VLOOKUP($H42,Measures!$C$46:$X$58,22,FALSE),IF($D42=\"Very Cold\",VLOOKUP($H42,Measures!$C$59:$X$72,22,FALSE),\" \"))))))","v":" "}," ",{"$f":"IF($G42=\"User-defined Measure\",VLOOKUP($H42,Measures!$C$73:$W$77,9,FALSE),IF($D42=\"Hot & Humid\",VLOOKUP($H42,Measures!$C$6:$W$19,9,FALSE),IF($D42=\"Hot & Dry\",VLOOKUP($H42,Measures!$C$20:$W$32,9,FALSE),IF($D42=\"Marine\",VLOOKUP($H42,Measures!$C$33:$W$45,9,FALSE),IF($D42=\"Cold\",VLOOKUP($H42,Measures!$C$46:$W$58,9,FALSE),IF($D42=\"Very Cold\",VLOOKUP($H42,Measures!$C$59:$W$72,9,FALSE),\" \"))))))","v":" "}," ",{"$f":"IF($G42=\"User-defined Measure\",VLOOKUP($H42,Measures!$C$73:$W$77,12,FALSE),IF($D42=\"Hot & Humid\",VLOOKUP($H42,Measures!$C$6:$W$19,12,FALSE),IF($D42=\"Hot & Dry\",VLOOKUP($H42,Measures!$C$20:$W$32,12,FALSE),IF($D42=\"Marine\",VLOOKUP($H42,Measures!$C$33:$W$45,12,FALSE),IF($D42=\"Cold\",VLOOKUP($H42,Measures!$C$46:$W$58,12,FALSE),IF($D42=\"Very Cold\",VLOOKUP($H42,Measures!$C$59:$W$72,12,FALSE),\" \"))))))","v":" "}," "," "," "," "]
[null,null,null,null,null,null,null,null,null,null,null,null,{"$f":"IF(F43<>0,VLOOKUP(F43,'Emission Factors'!$A$4:$J$31,7,FALSE),\" \")","v":" "},{"$f":"IF($G43=\"User-defined Measure\",VLOOKUP($H43,Measures!$C$73:$W$77,16,FALSE),IF($D43=\"Hot & Humid\",VLOOKUP($H43,Measures!$C$6:$W$19,16,FALSE),IF($D43=\"Hot & Dry\",VLOOKUP($H43,Measures!$C$20:$W$32,16,FALSE),IF($D43=\"Marine\",VLOOKUP($H43,Measures!$C$33:$W$45,16,FALSE),IF($D43=\"Cold\",VLOOKUP($H43,Measures!$C$46:$W$58,16,FALSE),IF($D43=\"Very Cold\",VLOOKUP($H43,Measures!$C$59:$W$72,16,FALSE),\" \"))))))","v":" "},{"$f":"IF($G43=\"User-defined Measure\",VLOOKUP($H43,Measures!$C$73:$W$77,19,FALSE),IF($D43=\"Hot & Humid\",VLOOKUP($H43,Measures!$C$6:$W$19,19,FALSE),IF($D43=\"Hot & Dry\",VLOOKUP($H43,Measures!$C$20:$W$32,19,FALSE),IF($D43=\"Marine\",VLOOKUP($H43,Measures!$C$33:$W$45,19,FALSE),IF($D43=\"Cold\",VLOOKUP($H43,Measures!$C$46:$W$58,19,FALSE),IF($D43=\"Very Cold\",VLOOKUP($H43,Measures!$C$59:$W$72,19,FALSE),\" \"))))))","v":" "}," "," "," ",{"$f":"IF(B43=0,\" \",PRODUCT(O43,'Emission Factors'!$J$36,E43,I43)/1000)","v":" "}," ","",{"$f":"IF($G43=\"User-defined Measure\",VLOOKUP($H43,Measures!$C$73:$X$77,22,FALSE),IF($D43=\"Hot & Humid\",VLOOKUP($H43,Measures!$C$6:$X$19,22,FALSE),IF($D43=\"Hot & Dry\",VLOOKUP($H43,Measures!$C$20:$X$32,22,FALSE),IF($D43=\"Marine\",VLOOKUP($H43,Measures!$C$33:$X$45,22,FALSE),IF($D43=\"Cold\",VLOOKUP($H43,Measures!$C$46:$X$58,22,FALSE),IF($D43=\"Very Cold\",VLOOKUP($H43,Measures!$C$59:$X$72,22,FALSE),\" \"))))))","v":" "}," ",{"$f":"IF($G43=\"User-defined Measure\",VLOOKUP($H43,Measures!$C$73:$W$77,9,FALSE),IF($D43=\"Hot & Humid\",VLOOKUP($H43,Measures!$C$6:$W$19,9,FALSE),IF($D43=\"Hot & Dry\",VLOOKUP($H43,Measures!$C$20:$W$32,9,FALSE),IF($D43=\"Marine\",VLOOKUP($H43,Measures!$C$33:$W$45,9,FALSE),IF($D43=\"Cold\",VLOOKUP($H43,Measures!$C$46:$W$58,9,FALSE),IF($D43=\"Very Cold\",VLOOKUP($H43,Measures!$C$59:$W$72,9,FALSE),\" \"))))))","v":" "}," ",{"$f":"IF($G43=\"User-defined Measure\",VLOOKUP($H43,Measures!$C$73:$W$77,12,FALSE),IF($D43=\"Hot & Humid\",VLOOKUP($H43,Measures!$C$6:$W$19,12,FALSE),IF($D43=\"Hot & Dry\",VLOOKUP($H43,Measures!$C$20:$W$32,12,FALSE),IF($D43=\"Marine\",VLOOKUP($H43,Measures!$C$33:$W$45,12,FALSE),IF($D43=\"Cold\",VLOOKUP($H43,Measures!$C$46:$W$58,12,FALSE),IF($D43=\"Very Cold\",VLOOKUP($H43,Measures!$C$59:$W$72,12,FALSE),\" \"))))))","v":" "}," "," "," "," "]
[null,null,null,null,null,null,null,null,null,null,null,null,{"$f":"IF(F44<>0,VLOOKUP(F44,'Emission Factors'!$A$4:$J$31,7,FALSE),\" \")","v":" "},{"$f":"IF($G44=\"User-defined Measure\",VLOOKUP($H44,Measures!$C$73:$W$77,16,FALSE),IF($D44=\"Hot & Humid\",VLOOKUP($H44,Measures!$C$6:$W$19,16,FALSE),IF($D44=\"Hot & Dry\",VLOOKUP($H44,Measures!$C$20:$W$32,16,FALSE),IF($D44=\"Marine\",VLOOKUP($H44,Measures!$C$33:$W$45,16,FALSE),IF($D44=\"Cold\",VLOOKUP($H44,Measures!$C$46:$W$58,16,FALSE),IF($D44=\"Very Cold\",VLOOKUP($H44,Measures!$C$59:$W$72,16,FALSE),\" \"))))))","v":" "},{"$f":"IF($G44=\"User-defined Measure\",VLOOKUP($H44,Measures!$C$73:$W$77,19,FALSE),IF($D44=\"Hot & Humid\",VLOOKUP($H44,Measures!$C$6:$W$19,19,FALSE),IF($D44=\"Hot & Dry\",VLOOKUP($H44,Measures!$C$20:$W$32,19,FALSE),IF($D44=\"Marine\",VLOOKUP($H44,Measures!$C$33:$W$45,19,FALSE),IF($D44=\"Cold\",VLOOKUP($H44,Measures!$C$46:$W$58,19,FALSE),IF($D44=\"Very Cold\",VLOOKUP($H44,Measures!$C$59:$W$72,19,FALSE),\" \"))))))","v":" "}," "," "," ",{"$f":"IF(B44=0,\" \",PRODUCT(O44,'Emission Factors'!$J$36,E44,I44)/1000)","v":" "}," ","",{"$f":"IF($G44=\"User-defined Measure\",VLOOKUP($H44,Measures!$C$73:$X$77,22,FALSE),IF($D44=\"Hot & Humid\",VLOOKUP($H44,Measures!$C$6:$X$19,22,FALSE),IF($D44=\"Hot & Dry\",VLOOKUP($H44,Measures!$C$20:$X$32,22,FALSE),IF($D44=\"Marine\",VLOOKUP($H44,Measures!$C$33:$X$45,22,FALSE),IF($D44=\"Cold\",VLOOKUP($H44,Measures!$C$46:$X$58,22,FALSE),IF($D44=\"Very Cold\",VLOOKUP($H44,Measures!$C$59:$X$72,22,FALSE),\" \"))))))","v":" "}," ",{"$f":"IF($G44=\"User-defined Measure\",VLOOKUP($H44,Measures!$C$73:$W$77,9,FALSE),IF($D44=\"Hot & Humid\",VLOOKUP($H44,Measures!$C$6:$W$19,9,FALSE),IF($D44=\"Hot & Dry\",VLOOKUP($H44,Measures!$C$20:$W$32,9,FALSE),IF($D44=\"Marine\",VLOOKUP($H44,Measures!$C$33:$W$45,9,FALSE),IF($D44=\"Cold\",VLOOKUP($H44,Measures!$C$46:$W$58,9,FALSE),IF($D44=\"Very Cold\",VLOOKUP($H44,Measures!$C$59:$W$72,9,FALSE),\" \"))))))","v":" "}," ",{"$f":"IF($G44=\"User-defined Measure\",VLOOKUP($H44,Measures!$C$73:$W$77,12,FALSE),IF($D44=\"Hot & Humid\",VLOOKUP($H44,Measures!$C$6:$W$19,12,FALSE),IF($D44=\"Hot & Dry\",VLOOKUP($H44,Measures!$C$20:$W$32,12,FALSE),IF($D44=\"Marine\",VLOOKUP($H44,Measures!$C$33:$W$45,12,FALSE),IF($D44=\"Cold\",VLOOKUP($H44,Measures!$C$46:$W$58,12,FALSE),IF($D44=\"Very Cold\",VLOOKUP($H44,Measures!$C$59:$W$72,12,FALSE),\" \"))))))","v":" "}," "," "," "," "]
[null,null,null,null,null,null,null,null,null,null,null,null,{"$f":"IF(F45<>0,VLOOKUP(F45,'Emission Factors'!$A$4:$J$31,7,FALSE),\" \")","v":" "},{"$f":"IF($G45=\"User-defined Measure\",VLOOKUP($H45,Measures!$C$73:$W$77,16,FALSE),IF($D45=\"Hot & Humid\",VLOOKUP($H45,Measures!$C$6:$W$19,16,FALSE),IF($D45=\"Hot & Dry\",VLOOKUP($H45,Measures!$C$20:$W$32,16,FALSE),IF($D45=\"Marine\",VLOOKUP($H45,Measures!$C$33:$W$45,16,FALSE),IF($D45=\"Cold\",VLOOKUP($H45,Measures!$C$46:$W$58,16,FALSE),IF($D45=\"Very Cold\",VLOOKUP($H45,Measures!$C$59:$W$72,16,FALSE),\" \"))))))","v":" "},{"$f":"IF($G45=\"User-defined Measure\",VLOOKUP($H45,Measures!$C$73:$W$77,19,FALSE),IF($D45=\"Hot & Humid\",VLOOKUP($H45,Measures!$C$6:$W$19,19,FALSE),IF($D45=\"Hot & Dry\",VLOOKUP($H45,Measures!$C$20:$W$32,19,FALSE),IF($D45=\"Marine\",VLOOKUP($H45,Measures!$C$33:$W$45,19,FALSE),IF($D45=\"Cold\",VLOOKUP($H45,Measures!$C$46:$W$58,19,FALSE),IF($D45=\"Very Cold\",VLOOKUP($H45,Measures!$C$59:$W$72,19,FALSE),\" \"))))))","v":" "},{"$f":"IF(B45=0,\" \",SUM(N45,O45))","v":" "},{"$f":"IF(B45=0,\" \",SUM(N45,O45)*E45*I45)","v":" "},{"$f":"IF(B45=0,\" \",PRODUCT(M45,N45,E45,I45)/1000)","v":" "},{"$f":"IF(B45=0,\" \",PRODUCT(O45,'Emission Factors'!$J$36,E45,I45)/1000)","v":" "},{"$f":"IF(B45=0,\" \",R45+S45)","v":" "},"",{"$f":"IF($G45=\"User-defined Measure\",VLOOKUP($H45,Measures!$C$73:$X$77,22,FALSE),IF($D45=\"Hot & Humid\",VLOOKUP($H45,Measures!$C$6:$X$19,22,FALSE),IF($D45=\"Hot & Dry\",VLOOKUP($H45,Measures!$C$20:$X$32,22,FALSE),IF($D45=\"Marine\",VLOOKUP($H45,Measures!$C$33:$X$45,22,FALSE),IF($D45=\"Cold\",VLOOKUP($H45,Measures!$C$46:$X$58,22,FALSE),IF($D45=\"Very Cold\",VLOOKUP($H45,Measures!$C$59:$X$72,22,FALSE),\" \"))))))","v":" "}," ",{"$f":"IF($G45=\"User-defined Measure\",VLOOKUP($H45,Measures!$C$73:$W$77,9,FALSE),IF($D45=\"Hot & Humid\",VLOOKUP($H45,Measures!$C$6:$W$19,9,FALSE),IF($D45=\"Hot & Dry\",VLOOKUP($H45,Measures!$C$20:$W$32,9,FALSE),IF($D45=\"Marine\",VLOOKUP($H45,Measures!$C$33:$W$45,9,FALSE),IF($D45=\"Cold\",VLOOKUP($H45,Measures!$C$46:$W$58,9,FALSE),IF($D45=\"Very Cold\",VLOOKUP($H45,Measures!$C$59:$W$72,9,FALSE),\" \"))))))","v":" "},{"$f":"IF(B45=0,\" \",PRODUCT(X45,E45,I45))","v":" "},{"$f":"IF($G45=\"User-defined Measure\",VLOOKUP($H45,Measures!$C$73:$W$77,12,FALSE),IF($D45=\"Hot & Humid\",VLOOKUP($H45,Measures!$C$6:$W$19,12,FALSE),IF($D45=\"Hot & Dry\",VLOOKUP($H45,Measures!$C$20:$W$32,12,FALSE),IF($D45=\"Marine\",VLOOKUP($H45,Measures!$C$33:$W$45,12,FALSE),IF($D45=\"Cold\",VLOOKUP($H45,Measures!$C$46:$W$58,12,FALSE),IF($D45=\"Very Cold\",VLOOKUP($H45,Measures!$C$59:$W$72,12,FALSE),\" \"))))))","v":" "},{"$f":"IF(B45=0,\" \",PRODUCT(Z45,E45,I45))","v":" "},{"$f":"IF(B45=0,\" \",Y45/AA45)","v":" "}," ",{"$f":"IF(B45=0,\" \",RANK(AC45,AC$13:AC$68,1))","v":" "}]
[null,null,null,null,null,null,null,null,null,null,null,null,{"$f":"IF(F46<>0,VLOOKUP(F46,'Emission Factors'!$A$4:$J$31,7,FALSE),\" \")","v":" "},{"$f":"IF($G46=\"User-defined Measure\",VLOOKUP($H46,Measures!$C$73:$W$77,16,FALSE),IF($D46=\"Hot & Humid\",VLOOKUP($H46,Measures!$C$6:$W$19,16,FALSE),IF($D46=\"Hot & Dry\",VLOOKUP($H46,Measures!$C$20:$W$32,16,FALSE),IF($D46=\"Marine\",VLOOKUP($H46,Measures!$C$33:$W$45,16,FALSE),IF($D46=\"Cold\",VLOOKUP($H46,Measures!$C$46:$W$58,16,FALSE),IF($D46=\"Very Cold\",VLOOKUP($H46,Measures!$C$59:$W$72,16,FALSE),\" \"))))))","v":" "},{"$f":"IF($G46=\"User-defined Measure\",VLOOKUP($H46,Measures!$C$73:$W$77,19,FALSE),IF($D46=\"Hot & Humid\",VLOOKUP($H46,Measures!$C$6:$W$19,19,FALSE),IF($D46=\"Hot & Dry\",VLOOKUP($H46,Measures!$C$20:$W$32,19,FALSE),IF($D46=\"Marine\",VLOOKUP($H46,Measures!$C$33:$W$45,19,FALSE),IF($D46=\"Cold\",VLOOKUP($H46,Measures!$C$46:$W$58,19,FALSE),IF($D46=\"Very Cold\",VLOOKUP($H46,Measures!$C$59:$W$72,19,FALSE),\" \"))))))","v":" "}," "," "," ",{"$f":"IF(B46=0,\" \",PRODUCT(O46,'Emission Factors'!$J$36,E46,I46)/1000)","v":" "}," ","",{"$f":"IF($G46=\"User-defined Measure\",VLOOKUP($H46,Measures!$C$73:$X$77,22,FALSE),IF($D46=\"Hot & Humid\",VLOOKUP($H46,Measures!$C$6:$X$19,22,FALSE),IF($D46=\"Hot & Dry\",VLOOKUP($H46,Measures!$C$20:$X$32,22,FALSE),IF($D46=\"Marine\",VLOOKUP($H46,Measures!$C$33:$X$45,22,FALSE),IF($D46=\"Cold\",VLOOKUP($H46,Measures!$C$46:$X$58,22,FALSE),IF($D46=\"Very Cold\",VLOOKUP($H46,Measures!$C$59:$X$72,22,FALSE),\" \"))))))","v":" "}," ",{"$f":"IF($G46=\"User-defined Measure\",VLOOKUP($H46,Measures!$C$73:$W$77,9,FALSE),IF($D46=\"Hot & Humid\",VLOOKUP($H46,Measures!$C$6:$W$19,9,FALSE),IF($D46=\"Hot & Dry\",VLOOKUP($H46,Measures!$C$20:$W$32,9,FALSE),IF($D46=\"Marine\",VLOOKUP($H46,Measures!$C$33:$W$45,9,FALSE),IF($D46=\"Cold\",VLOOKUP($H46,Measures!$C$46:$W$58,9,FALSE),IF($D46=\"Very Cold\",VLOOKUP($H46,Measures!$C$59:$W$72,9,FALSE),\" \"))))))","v":" "}," ",{"$f":"IF($G46=\"User-defined Measure\",VLOOKUP($H46,Measures!$C$73:$W$77,12,FALSE),IF($D46=\"Hot & Humid\",VLOOKUP($H46,Measures!$C$6:$W$19,12,FALSE),IF($D46=\"Hot & Dry\",VLOOKUP($H46,Measures!$C$20:$W$32,12,FALSE),IF($D46=\"Marine\",VLOOKUP($H46,Measures!$C$33:$W$45,12,FALSE),IF($D46=\"Cold\",VLOOKUP($H46,Measures!$C$46:$W$58,12,FALSE),IF($D46=\"Very Cold\",VLOOKUP($H46,Measures!$C$59:$W$72,12,FALSE),\" \"))))))","v":" "}," "," "," "," "]
[null,null,null,null,null,null,null,null,null,null,null,null,{"$f":"IF(F47<>0,VLOOKUP(F47,'Emission Factors'!$A$4:$J$31,7,FALSE),\" \")","v":" "},{"$f":"IF($G47=\"User-defined Measure\",VLOOKUP($H47,Measures!$C$73:$W$77,16,FALSE),IF($D47=\"Hot & Humid\",VLOOKUP($H47,Measures!$C$6:$W$19,16,FALSE),IF($D47=\"Hot & Dry\",VLOOKUP($H47,Measures!$C$20:$W$32,16,FALSE),IF($D47=\"Marine\",VLOOKUP($H47,Measures!$C$33:$W$45,16,FALSE),IF($D47=\"Cold\",VLOOKUP($H47,Measures!$C$46:$W$58,16,FALSE),IF($D47=\"Very Cold\",VLOOKUP($H47,Measures!$C$59:$W$72,16,FALSE),\" \"))))))","v":" "},{"$f":"IF($G47=\"User-defined Measure\",VLOOKUP($H47,Measures!$C$73:$W$77,19,FALSE),IF($D47=\"Hot & Humid\",VLOOKUP($H47,Measures!$C$6:$W$19,19,FALSE),IF($D47=\"Hot & Dry\",VLOOKUP($H47,Measures!$C$20:$W$32,19,FALSE),IF($D47=\"Marine\",VLOOKUP($H47,Measures!$C$33:$W$45,19,FALSE),IF($D47=\"Cold\",VLOOKUP($H47,Measures!$C$46:$W$58,19,FALSE),IF($D47=\"Very Cold\",VLOOKUP($H47,Measures!$C$59:$W$72,19,FALSE),\" \"))))))","v":" "}," "," "," ",{"$f":"IF(B47=0,\" \",PRODUCT(O47,'Emission Factors'!$J$36,E47,I47)/1000)","v":" "}," ","",{"$f":"IF($G47=\"User-defined Measure\",VLOOKUP($H47,Measures!$C$73:$X$77,22,FALSE),IF($D47=\"Hot & Humid\",VLOOKUP($H47,Measures!$C$6:$X$19,22,FALSE),IF($D47=\"Hot & Dry\",VLOOKUP($H47,Measures!$C$20:$X$32,22,FALSE),IF($D47=\"Marine\",VLOOKUP($H47,Measures!$C$33:$X$45,22,FALSE),IF($D47=\"Cold\",VLOOKUP($H47,Measures!$C$46:$X$58,22,FALSE),IF($D47=\"Very Cold\",VLOOKUP($H47,Measures!$C$59:$X$72,22,FALSE),\" \"))))))","v":" "}," ",{"$f":"IF($G47=\"User-defined Measure\",VLOOKUP($H47,Measures!$C$73:$W$77,9,FALSE),IF($D47=\"Hot & Humid\",VLOOKUP($H47,Measures!$C$6:$W$19,9,FALSE),IF($D47=\"Hot & Dry\",VLOOKUP($H47,Measures!$C$20:$W$32,9,FALSE),IF($D47=\"Marine\",VLOOKUP($H47,Measures!$C$33:$W$45,9,FALSE),IF($D47=\"Cold\",VLOOKUP($H47,Measures!$C$46:$W$58,9,FALSE),IF($D47=\"Very Cold\",VLOOKUP($H47,Measures!$C$59:$W$72,9,FALSE),\" \"))))))","v":" "}," ",{"$f":"IF($G47=\"User-defined Measure\",VLOOKUP($H47,Measures!$C$73:$W$77,12,FALSE),IF($D47=\"Hot & Humid\",VLOOKUP($H47,Measures!$C$6:$W$19,12,FALSE),IF($D47=\"Hot & Dry\",VLOOKUP($H47,Measures!$C$20:$W$32,12,FALSE),IF($D47=\"Marine\",VLOOKUP($H47,Measures!$C$33:$W$45,12,FALSE),IF($D47=\"Cold\",VLOOKUP($H47,Measures!$C$46:$W$58,12,FALSE),IF($D47=\"Very Cold\",VLOOKUP($H47,Measures!$C$59:$W$72,12,FALSE),\" \"))))))","v":" "}," "," "," "," "]
[null,null,null,null,null,null,null,null,null,null,null,null,{"$f":"IF(F48<>0,VLOOKUP(F48,'Emission Factors'!$A$4:$J$31,7,FALSE),\" \")","v":" "},{"$f":"IF($G48=\"User-defined Measure\",VLOOKUP($H48,Measures!$C$73:$W$77,16,FALSE),IF($D48=\"Hot & Humid\",VLOOKUP($H48,Measures!$C$6:$W$19,16,FALSE),IF($D48=\"Hot & Dry\",VLOOKUP($H48,Measures!$C$20:$W$32,16,FALSE),IF($D48=\"Marine\",VLOOKUP($H48,Measures!$C$33:$W$45,16,FALSE),IF($D48=\"Cold\",VLOOKUP($H48,Measures!$C$46:$W$58,16,FALSE),IF($D48=\"Very Cold\",VLOOKUP($H48,Measures!$C$59:$W$72,16,FALSE),\" \"))))))","v":" "},{"$f":"IF($G48=\"User-defined Measure\",VLOOKUP($H48,Measures!$C$73:$W$77,19,FALSE),IF($D48=\"Hot & Humid\",VLOOKUP($H48,Measures!$C$6:$W$19,19,FALSE),IF($D48=\"Hot & Dry\",VLOOKUP($H48,Measures!$C$20:$W$32,19,FALSE),IF($D48=\"Marine\",VLOOKUP($H48,Measures!$C$33:$W$45,19,FALSE),IF($D48=\"Cold\",VLOOKUP($H48,Measures!$C$46:$W$58,19,FALSE),IF($D48=\"Very Cold\",VLOOKUP($H48,Measures!$C$59:$W$72,19,FALSE),\" \"))))))","v":" "}," "," "," ",{"$f":"IF(B48=0,\" \",PRODUCT(O48,'Emission Factors'!$J$36,E48,I48)/1000)","v":" "}," ","",{"$f":"IF($G48=\"User-defined Measure\",VLOOKUP($H48,Measures!$C$73:$X$77,22,FALSE),IF($D48=\"Hot & Humid\",VLOOKUP($H48,Measures!$C$6:$X$19,22,FALSE),IF($D48=\"Hot & Dry\",VLOOKUP($H48,Measures!$C$20:$X$32,22,FALSE),IF($D48=\"Marine\",VLOOKUP($H48,Measures!$C$33:$X$45,22,FALSE),IF($D48=\"Cold\",VLOOKUP($H48,Measures!$C$46:$X$58,22,FALSE),IF($D48=\"Very Cold\",VLOOKUP($H48,Measures!$C$59:$X$72,22,FALSE),\" \"))))))","v":" "}," ",{"$f":"IF($G48=\"User-defined Measure\",VLOOKUP($H48,Measures!$C$73:$W$77,9,FALSE),IF($D48=\"Hot & Humid\",VLOOKUP($H48,Measures!$C$6:$W$19,9,FALSE),IF($D48=\"Hot & Dry\",VLOOKUP($H48,Measures!$C$20:$W$32,9,FALSE),IF($D48=\"Marine\",VLOOKUP($H48,Measures!$C$33:$W$45,9,FALSE),IF($D48=\"Cold\",VLOOKUP($H48,Measures!$C$46:$W$58,9,FALSE),IF($D48=\"Very Cold\",VLOOKUP($H48,Measures!$C$59:$W$72,9,FALSE),\" \"))))))","v":" "}," ",{"$f":"IF($G48=\"User-defined Measure\",VLOOKUP($H48,Measures!$C$73:$W$77,12,FALSE),IF($D48=\"Hot & Humid\",VLOOKUP($H48,Measures!$C$6:$W$19,12,FALSE),IF($D48=\"Hot & Dry\",VLOOKUP($H48,Measures!$C$20:$W$32,12,FALSE),IF($D48=\"Marine\",VLOOKUP($H48,Measures!$C$33:$W$45,12,FALSE),IF($D48=\"Cold\",VLOOKUP($H48,Measures!$C$46:$W$58,12,FALSE),IF($D48=\"Very Cold\",VLOOKUP($H48,Measures!$C$59:$W$72,12,FALSE),\" \"))))))","v":" "}," "," "," "," "]
[null,null,null,null,null,null,null,null,null,null,null,null,{"$f":"IF(F49<>0,VLOOKUP(F49,'Emission Factors'!$A$4:$J$31,7,FALSE),\" \")","v":" "},{"$f":"IF($G49=\"User-defined Measure\",VLOOKUP($H49,Measures!$C$73:$W$77,16,FALSE),IF($D49=\"Hot & Humid\",VLOOKUP($H49,Measures!$C$6:$W$19,16,FALSE),IF($D49=\"Hot & Dry\",VLOOKUP($H49,Measures!$C$20:$W$32,16,FALSE),IF($D49=\"Marine\",VLOOKUP($H49,Measures!$C$33:$W$45,16,FALSE),IF($D49=\"Cold\",VLOOKUP($H49,Measures!$C$46:$W$58,16,FALSE),IF($D49=\"Very Cold\",VLOOKUP($H49,Measures!$C$59:$W$72,16,FALSE),\" \"))))))","v":" "},{"$f":"IF($G49=\"User-defined Measure\",VLOOKUP($H49,Measures!$C$73:$W$77,19,FALSE),IF($D49=\"Hot & Humid\",VLOOKUP($H49,Measures!$C$6:$W$19,19,FALSE),IF($D49=\"Hot & Dry\",VLOOKUP($H49,Measures!$C$20:$W$32,19,FALSE),IF($D49=\"Marine\",VLOOKUP($H49,Measures!$C$33:$W$45,19,FALSE),IF($D49=\"Cold\",VLOOKUP($H49,Measures!$C$46:$W$58,19,FALSE),IF($D49=\"Very Cold\",VLOOKUP($H49,Measures!$C$59:$W$72,19,FALSE),\" \"))))))","v":" "}," "," "," ",{"$f":"IF(B49=0,\" \",PRODUCT(O49,'Emission Factors'!$J$36,E49,I49)/1000)","v":" "}," ","",{"$f":"IF($G49=\"User-defined Measure\",VLOOKUP($H49,Measures!$C$73:$X$77,22,FALSE),IF($D49=\"Hot & Humid\",VLOOKUP($H49,Measures!$C$6:$X$19,22,FALSE),IF($D49=\"Hot & Dry\",VLOOKUP($H49,Measures!$C$20:$X$32,22,FALSE),IF($D49=\"Marine\",VLOOKUP($H49,Measures!$C$33:$X$45,22,FALSE),IF($D49=\"Cold\",VLOOKUP($H49,Measures!$C$46:$X$58,22,FALSE),IF($D49=\"Very Cold\",VLOOKUP($H49,Measures!$C$59:$X$72,22,FALSE),\" \"))))))","v":" "}," ",{"$f":"IF($G49=\"User-defined Measure\",VLOOKUP($H49,Measures!$C$73:$W$77,9,FALSE),IF($D49=\"Hot & Humid\",VLOOKUP($H49,Measures!$C$6:$W$19,9,FALSE),IF($D49=\"Hot & Dry\",VLOOKUP($H49,Measures!$C$20:$W$32,9,FALSE),IF($D49=\"Marine\",VLOOKUP($H49,Measures!$C$33:$W$45,9,FALSE),IF($D49=\"Cold\",VLOOKUP($H49,Measures!$C$46:$W$58,9,FALSE),IF($D49=\"Very Cold\",VLOOKUP($H49,Measures!$C$59:$W$72,9,FALSE),\" \"))))))","v":" "}," ",{"$f":"IF($G49=\"User-defined Measure\",VLOOKUP($H49,Measures!$C$73:$W$77,12,FALSE),IF($D49=\"Hot & Humid\",VLOOKUP($H49,Measures!$C$6:$W$19,12,FALSE),IF($D49=\"Hot & Dry\",VLOOKUP($H49,Measures!$C$20:$W$32,12,FALSE),IF($D49=\"Marine\",VLOOKUP($H49,Measures!$C$33:$W$45,12,FALSE),IF($D49=\"Cold\",VLOOKUP($H49,Measures!$C$46:$W$58,12,FALSE),IF($D49=\"Very Cold\",VLOOKUP($H49,Measures!$C$59:$W$72,12,FALSE),\" \"))))))","v":" "}," "," "," "," "]
[null,null,null,null,null,null,null,null,null,null,null,null,{"$f":"IF(F50<>0,VLOOKUP(F50,'Emission Factors'!$A$4:$J$31,7,FALSE),\" \")","v":" "},{"$f":"IF($G50=\"User-defined Measure\",VLOOKUP($H50,Measures!$C$73:$W$77,16,FALSE),IF($D50=\"Hot & Humid\",VLOOKUP($H50,Measures!$C$6:$W$19,16,FALSE),IF($D50=\"Hot & Dry\",VLOOKUP($H50,Measures!$C$20:$W$32,16,FALSE),IF($D50=\"Marine\",VLOOKUP($H50,Measures!$C$33:$W$45,16,FALSE),IF($D50=\"Cold\",VLOOKUP($H50,Measures!$C$46:$W$58,16,FALSE),IF($D50=\"Very Cold\",VLOOKUP($H50,Measures!$C$59:$W$72,16,FALSE),\" \"))))))","v":" "},{"$f":"IF($G50=\"User-defined Measure\",VLOOKUP($H50,Measures!$C$73:$W$77,19,FALSE),IF($D50=\"Hot & Humid\",VLOOKUP($H50,Measures!$C$6:$W$19,19,FALSE),IF($D50=\"Hot & Dry\",VLOOKUP($H50,Measures!$C$20:$W$32,19,FALSE),IF($D50=\"Marine\",VLOOKUP($H50,Measures!$C$33:$W$45,19,FALSE),IF($D50=\"Cold\",VLOOKUP($H50,Measures!$C$46:$W$58,19,FALSE),IF($D50=\"Very Cold\",VLOOKUP($H50,Measures!$C$59:$W$72,19,FALSE),\" \"))))))","v":" "}," "," "," ",{"$f":"IF(B50=0,\" \",PRODUCT(O50,'Emission Factors'!$J$36,E50,I50)/1000)","v":" "}," ","",{"$f":"IF($G50=\"User-defined Measure\",VLOOKUP($H50,Measures!$C$73:$X$77,22,FALSE),IF($D50=\"Hot & Humid\",VLOOKUP($H50,Measures!$C$6:$X$19,22,FALSE),IF($D50=\"Hot & Dry\",VLOOKUP($H50,Measures!$C$20:$X$32,22,FALSE),IF($D50=\"Marine\",VLOOKUP($H50,Measures!$C$33:$X$45,22,FALSE),IF($D50=\"Cold\",VLOOKUP($H50,Measures!$C$46:$X$58,22,FALSE),IF($D50=\"Very Cold\",VLOOKUP($H50,Measures!$C$59:$X$72,22,FALSE),\" \"))))))","v":" "}," ",{"$f":"IF($G50=\"User-defined Measure\",VLOOKUP($H50,Measures!$C$73:$W$77,9,FALSE),IF($D50=\"Hot & Humid\",VLOOKUP($H50,Measures!$C$6:$W$19,9,FALSE),IF($D50=\"Hot & Dry\",VLOOKUP($H50,Measures!$C$20:$W$32,9,FALSE),IF($D50=\"Marine\",VLOOKUP($H50,Measures!$C$33:$W$45,9,FALSE),IF($D50=\"Cold\",VLOOKUP($H50,Measures!$C$46:$W$58,9,FALSE),IF($D50=\"Very Cold\",VLOOKUP($H50,Measures!$C$59:$W$72,9,FALSE),\" \"))))))","v":" "}," ",{"$f":"IF($G50=\"User-defined Measure\",VLOOKUP($H50,Measures!$C$73:$W$77,12,FALSE),IF($D50=\"Hot & Humid\",VLOOKUP($H50,Measures!$C$6:$W$19,12,FALSE),IF($D50=\"Hot & Dry\",VLOOKUP($H50,Measures!$C$20:$W$32,12,FALSE),IF($D50=\"Marine\",VLOOKUP($H50,Measures!$C$33:$W$45,12,FALSE),IF($D50=\"Cold\",VLOOKUP($H50,Measures!$C$46:$W$58,12,FALSE),IF($D50=\"Very Cold\",VLOOKUP($H50,Measures!$C$59:$W$72,12,FALSE),\" \"))))))","v":" "}," "," "," "," "]
[null,null,null,null,null,null,null,null,null,null,null,null,{"$f":"IF(F51<>0,VLOOKUP(F51,'Emission Factors'!$A$4:$J$31,7,FALSE),\" \")","v":" "},{"$f":"IF($G51=\"User-defined Measure\",VLOOKUP($H51,Measures!$C$73:$W$77,16,FALSE),IF($D51=\"Hot & Humid\",VLOOKUP($H51,Measures!$C$6:$W$19,16,FALSE),IF($D51=\"Hot & Dry\",VLOOKUP($H51,Measures!$C$20:$W$32,16,FALSE),IF($D51=\"Marine\",VLOOKUP($H51,Measures!$C$33:$W$45,16,FALSE),IF($D51=\"Cold\",VLOOKUP($H51,Measures!$C$46:$W$58,16,FALSE),IF($D51=\"Very Cold\",VLOOKUP($H51,Measures!$C$59:$W$72,16,FALSE),\" \"))))))","v":" "},{"$f":"IF($G51=\"User-defined Measure\",VLOOKUP($H51,Measures!$C$73:$W$77,19,FALSE),IF($D51=\"Hot & Humid\",VLOOKUP($H51,Measures!$C$6:$W$19,19,FALSE),IF($D51=\"Hot & Dry\",VLOOKUP($H51,Measures!$C$20:$W$32,19,FALSE),IF($D51=\"Marine\",VLOOKUP($H51,Measures!$C$33:$W$45,19,FALSE),IF($D51=\"Cold\",VLOOKUP($H51,Measures!$C$46:$W$58,19,FALSE),IF($D51=\"Very Cold\",VLOOKUP($H51,Measures!$C$59:$W$72,19,FALSE),\" \"))))))","v":" "}," "," "," ",{"$f":"IF(B51=0,\" \",PRODUCT(O51,'Emission Factors'!$J$36,E51,I51)/1000)","v":" "}," ",{"$f":"IF(E51=0,\"\",PRODUCT(1000,(T51/PRODUCT(E51,I51))))","v":""},{"$f":"IF($G51=\"User-defined Measure\",VLOOKUP($H51,Measures!$C$73:$X$77,22,FALSE),IF($D51=\"Hot & Humid\",VLOOKUP($H51,Measures!$C$6:$X$19,22,FALSE),IF($D51=\"Hot & Dry\",VLOOKUP($H51,Measures!$C$20:$X$32,22,FALSE),IF($D51=\"Marine\",VLOOKUP($H51,Measures!$C$33:$X$45,22,FALSE),IF($D51=\"Cold\",VLOOKUP($H51,Measures!$C$46:$X$58,22,FALSE),IF($D51=\"Very Cold\",VLOOKUP($H51,Measures!$C$59:$X$72,22,FALSE),\" \"))))))","v":" "}," ",{"$f":"IF($G51=\"User-defined Measure\",VLOOKUP($H51,Measures!$C$73:$W$77,9,FALSE),IF($D51=\"Hot & Humid\",VLOOKUP($H51,Measures!$C$6:$W$19,9,FALSE),IF($D51=\"Hot & Dry\",VLOOKUP($H51,Measures!$C$20:$W$32,9,FALSE),IF($D51=\"Marine\",VLOOKUP($H51,Measures!$C$33:$W$45,9,FALSE),IF($D51=\"Cold\",VLOOKUP($H51,Measures!$C$46:$W$58,9,FALSE),IF($D51=\"Very Cold\",VLOOKUP($H51,Measures!$C$59:$W$72,9,FALSE),\" \"))))))","v":" "}," ",{"$f":"IF($G51=\"User-defined Measure\",VLOOKUP($H51,Measures!$C$73:$W$77,12,FALSE),IF($D51=\"Hot & Humid\",VLOOKUP($H51,Measures!$C$6:$W$19,12,FALSE),IF($D51=\"Hot & Dry\",VLOOKUP($H51,Measures!$C$20:$W$32,12,FALSE),IF($D51=\"Marine\",VLOOKUP($H51,Measures!$C$33:$W$45,12,FALSE),IF($D51=\"Cold\",VLOOKUP($H51,Measures!$C$46:$W$58,12,FALSE),IF($D51=\"Very Cold\",VLOOKUP($H51,Measures!$C$59:$W$72,12,FALSE),\" \"))))))","v":" "}," "," "," "," "]
[null,null,null,null,null,null,null,null,null,null,null,null,{"$f":"IF(F52<>0,VLOOKUP(F52,'Emission Factors'!$A$4:$J$31,7,FALSE),\" \")","v":" "},{"$f":"IF($G52=\"User-defined Measure\",VLOOKUP($H52,Measures!$C$73:$W$77,16,FALSE),IF($D52=\"Hot & Humid\",VLOOKUP($H52,Measures!$C$6:$W$19,16,FALSE),IF($D52=\"Hot & Dry\",VLOOKUP($H52,Measures!$C$20:$W$32,16,FALSE),IF($D52=\"Marine\",VLOOKUP($H52,Measures!$C$33:$W$45,16,FALSE),IF($D52=\"Cold\",VLOOKUP($H52,Measures!$C$46:$W$58,16,FALSE),IF($D52=\"Very Cold\",VLOOKUP($H52,Measures!$C$59:$W$72,16,FALSE),\" \"))))))","v":" "},{"$f":"IF($G52=\"User-defined Measure\",VLOOKUP($H52,Measures!$C$73:$W$77,19,FALSE),IF($D52=\"Hot & Humid\",VLOOKUP($H52,Measures!$C$6:$W$19,19,FALSE),IF($D52=\"Hot & Dry\",VLOOKUP($H52,Measures!$C$20:$W$32,19,FALSE),IF($D52=\"Marine\",VLOOKUP($H52,Measures!$C$33:$W$45,19,FALSE),IF($D52=\"Cold\",VLOOKUP($H52,Measures!$C$46:$W$58,19,FALSE),IF($D52=\"Very Cold\",VLOOKUP($H52,Measures!$C$59:$W$72,19,FALSE),\" \"))))))","v":" "}," "," "," ",{"$f":"IF(B52=0,\" \",PRODUCT(O52,'Emission Factors'!$J$36,E52,I52)/1000)","v":" "}," ","",{"$f":"IF($G52=\"User-defined Measure\",VLOOKUP($H52,Measures!$C$73:$X$77,22,FALSE),IF($D52=\"Hot & Humid\",VLOOKUP($H52,Measures!$C$6:$X$19,22,FALSE),IF($D52=\"Hot & Dry\",VLOOKUP($H52,Measures!$C$20:$X$32,22,FALSE),IF($D52=\"Marine\",VLOOKUP($H52,Measures!$C$33:$X$45,22,FALSE),IF($D52=\"Cold\",VLOOKUP($H52,Measures!$C$46:$X$58,22,FALSE),IF($D52=\"Very Cold\",VLOOKUP($H52,Measures!$C$59:$X$72,22,FALSE),\" \"))))))","v":" "}," ",{"$f":"IF($G52=\"User-defined Measure\",VLOOKUP($H52,Measures!$C$73:$W$77,9,FALSE),IF($D52=\"Hot & Humid\",VLOOKUP($H52,Measures!$C$6:$W$19,9,FALSE),IF($D52=\"Hot & Dry\",VLOOKUP($H52,Measures!$C$20:$W$32,9,FALSE),IF($D52=\"Marine\",VLOOKUP($H52,Measures!$C$33:$W$45,9,FALSE),IF($D52=\"Cold\",VLOOKUP($H52,Measures!$C$46:$W$58,9,FALSE),IF($D52=\"Very Cold\",VLOOKUP($H52,Measures!$C$59:$W$72,9,FALSE),\" \"))))))","v":" "}," ",{"$f":"IF($G52=\"User-defined Measure\",VLOOKUP($H52,Measures!$C$73:$W$77,12,FALSE),IF($D52=\"Hot & Humid\",VLOOKUP($H52,Measures!$C$6:$W$19,12,FALSE),IF($D52=\"Hot & Dry\",VLOOKUP($H52,Measures!$C$20:$W$32,12,FALSE),IF($D52=\"Marine\",VLOOKUP($H52,Measures!$C$33:$W$45,12,FALSE),IF($D52=\"Cold\",VLOOKUP($H52,Measures!$C$46:$W$58,12,FALSE),IF($D52=\"Very Cold\",VLOOKUP($H52,Measures!$C$59:$W$72,12,FALSE),\" \"))))))","v":" "}," "," "," "," "]
[null,null,null,null,null,null,null,null,null,null,null,null,{"$f":"IF(F53<>0,VLOOKUP(F53,'Emission Factors'!$A$4:$J$31,7,FALSE),\" \")","v":" "},{"$f":"IF($G53=\"User-defined Measure\",VLOOKUP($H53,Measures!$C$73:$W$77,16,FALSE),IF($D53=\"Hot & Humid\",VLOOKUP($H53,Measures!$C$6:$W$19,16,FALSE),IF($D53=\"Hot & Dry\",VLOOKUP($H53,Measures!$C$20:$W$32,16,FALSE),IF($D53=\"Marine\",VLOOKUP($H53,Measures!$C$33:$W$45,16,FALSE),IF($D53=\"Cold\",VLOOKUP($H53,Measures!$C$46:$W$58,16,FALSE),IF($D53=\"Very Cold\",VLOOKUP($H53,Measures!$C$59:$W$72,16,FALSE),\" \"))))))","v":" "},{"$f":"IF($G53=\"User-defined Measure\",VLOOKUP($H53,Measures!$C$73:$W$77,19,FALSE),IF($D53=\"Hot & Humid\",VLOOKUP($H53,Measures!$C$6:$W$19,19,FALSE),IF($D53=\"Hot & Dry\",VLOOKUP($H53,Measures!$C$20:$W$32,19,FALSE),IF($D53=\"Marine\",VLOOKUP($H53,Measures!$C$33:$W$45,19,FALSE),IF($D53=\"Cold\",VLOOKUP($H53,Measures!$C$46:$W$58,19,FALSE),IF($D53=\"Very Cold\",VLOOKUP($H53,Measures!$C$59:$W$72,19,FALSE),\" \"))))))","v":" "}," "," "," ",{"$f":"IF(B53=0,\" \",PRODUCT(O53,'Emission Factors'!$J$36,E53,I53)/1000)","v":" "}," ","",{"$f":"IF($G53=\"User-defined Measure\",VLOOKUP($H53,Measures!$C$73:$X$77,22,FALSE),IF($D53=\"Hot & Humid\",VLOOKUP($H53,Measures!$C$6:$X$19,22,FALSE),IF($D53=\"Hot & Dry\",VLOOKUP($H53,Measures!$C$20:$X$32,22,FALSE),IF($D53=\"Marine\",VLOOKUP($H53,Measures!$C$33:$X$45,22,FALSE),IF($D53=\"Cold\",VLOOKUP($H53,Measures!$C$46:$X$58,22,FALSE),IF($D53=\"Very Cold\",VLOOKUP($H53,Measures!$C$59:$X$72,22,FALSE),\" \"))))))","v":" "}," ",{"$f":"IF($G53=\"User-defined Measure\",VLOOKUP($H53,Measures!$C$73:$W$77,9,FALSE),IF($D53=\"Hot & Humid\",VLOOKUP($H53,Measures!$C$6:$W$19,9,FALSE),IF($D53=\"Hot & Dry\",VLOOKUP($H53,Measures!$C$20:$W$32,9,FALSE),IF($D53=\"Marine\",VLOOKUP($H53,Measures!$C$33:$W$45,9,FALSE),IF($D53=\"Cold\",VLOOKUP($H53,Measures!$C$46:$W$58,9,FALSE),IF($D53=\"Very Cold\",VLOOKUP($H53,Measures!$C$59:$W$72,9,FALSE),\" \"))))))","v":" "}," ",{"$f":"IF($G53=\"User-defined Measure\",VLOOKUP($H53,Measures!$C$73:$W$77,12,FALSE),IF($D53=\"Hot & Humid\",VLOOKUP($H53,Measures!$C$6:$W$19,12,FALSE),IF($D53=\"Hot & Dry\",VLOOKUP($H53,Measures!$C$20:$W$32,12,FALSE),IF($D53=\"Marine\",VLOOKUP($H53,Measures!$C$33:$W$45,12,FALSE),IF($D53=\"Cold\",VLOOKUP($H53,Measures!$C$46:$W$58,12,FALSE),IF($D53=\"Very Cold\",VLOOKUP($H53,Measures!$C$59:$W$72,12,FALSE),\" \"))))))","v":" "}," "," "," "," "]
[null,null,null,null,null,null,null,null,null,null,null,null,{"$f":"IF(F54<>0,VLOOKUP(F54,'Emission Factors'!$A$4:$J$31,7,FALSE),\" \")","v":" "},{"$f":"IF($G54=\"User-defined Measure\",VLOOKUP($H54,Measures!$C$73:$W$77,16,FALSE),IF($D54=\"Hot & Humid\",VLOOKUP($H54,Measures!$C$6:$W$19,16,FALSE),IF($D54=\"Hot & Dry\",VLOOKUP($H54,Measures!$C$20:$W$32,16,FALSE),IF($D54=\"Marine\",VLOOKUP($H54,Measures!$C$33:$W$45,16,FALSE),IF($D54=\"Cold\",VLOOKUP($H54,Measures!$C$46:$W$58,16,FALSE),IF($D54=\"Very Cold\",VLOOKUP($H54,Measures!$C$59:$W$72,16,FALSE),\" \"))))))","v":" "},{"$f":"IF($G54=\"User-defined Measure\",VLOOKUP($H54,Measures!$C$73:$W$77,19,FALSE),IF($D54=\"Hot & Humid\",VLOOKUP($H54,Measures!$C$6:$W$19,19,FALSE),IF($D54=\"Hot & Dry\",VLOOKUP($H54,Measures!$C$20:$W$32,19,FALSE),IF($D54=\"Marine\",VLOOKUP($H54,Measures!$C$33:$W$45,19,FALSE),IF($D54=\"Cold\",VLOOKUP($H54,Measures!$C$46:$W$58,19,FALSE),IF($D54=\"Very Cold\",VLOOKUP($H54,Measures!$C$59:$W$72,19,FALSE),\" \"))))))","v":" "}," "," "," ",{"$f":"IF(B54=0,\" \",PRODUCT(O54,'Emission Factors'!$J$36,E54,I54)/1000)","v":" "}," ","",{"$f":"IF($G54=\"User-defined Measure\",VLOOKUP($H54,Measures!$C$73:$X$77,22,FALSE),IF($D54=\"Hot & Humid\",VLOOKUP($H54,Measures!$C$6:$X$19,22,FALSE),IF($D54=\"Hot & Dry\",VLOOKUP($H54,Measures!$C$20:$X$32,22,FALSE),IF($D54=\"Marine\",VLOOKUP($H54,Measures!$C$33:$X$45,22,FALSE),IF($D54=\"Cold\",VLOOKUP($H54,Measures!$C$46:$X$58,22,FALSE),IF($D54=\"Very Cold\",VLOOKUP($H54,Measures!$C$59:$X$72,22,FALSE),\" \"))))))","v":" "}," ",{"$f":"IF($G54=\"User-defined Measure\",VLOOKUP($H54,Measures!$C$73:$W$77,9,FALSE),IF($D54=\"Hot & Humid\",VLOOKUP($H54,Measures!$C$6:$W$19,9,FALSE),IF($D54=\"Hot & Dry\",VLOOKUP($H54,Measures!$C$20:$W$32,9,FALSE),IF($D54=\"Marine\",VLOOKUP($H54,Measures!$C$33:$W$45,9,FALSE),IF($D54=\"Cold\",VLOOKUP($H54,Measures!$C$46:$W$58,9,FALSE),IF($D54=\"Very Cold\",VLOOKUP($H54,Measures!$C$59:$W$72,9,FALSE),\" \"))))))","v":" "}," ",{"$f":"IF($G54=\"User-defined Measure\",VLOOKUP($H54,Measures!$C$73:$W$77,12,FALSE),IF($D54=\"Hot & Humid\",VLOOKUP($H54,Measures!$C$6:$W$19,12,FALSE),IF($D54=\"Hot & Dry\",VLOOKUP($H54,Measures!$C$20:$W$32,12,FALSE),IF($D54=\"Marine\",VLOOKUP($H54,Measures!$C$33:$W$45,12,FALSE),IF($D54=\"Cold\",VLOOKUP($H54,Measures!$C$46:$W$58,12,FALSE),IF($D54=\"Very Cold\",VLOOKUP($H54,Measures!$C$59:$W$72,12,FALSE),\" \"))))))","v":" "}," "," "," "," "]
[null,null,null,null,null,null,null,null,null,null,null,null,{"$f":"IF(F55<>0,VLOOKUP(F55,'Emission Factors'!$A$4:$J$31,7,FALSE),\" \")","v":" "},{"$f":"IF($G55=\"User-defined Measure\",VLOOKUP($H55,Measures!$C$73:$W$77,16,FALSE),IF($D55=\"Hot & Humid\",VLOOKUP($H55,Measures!$C$6:$W$19,16,FALSE),IF($D55=\"Hot & Dry\",VLOOKUP($H55,Measures!$C$20:$W$32,16,FALSE),IF($D55=\"Marine\",VLOOKUP($H55,Measures!$C$33:$W$45,16,FALSE),IF($D55=\"Cold\",VLOOKUP($H55,Measures!$C$46:$W$58,16,FALSE),IF($D55=\"Very Cold\",VLOOKUP($H55,Measures!$C$59:$W$72,16,FALSE),\" \"))))))","v":" "},{"$f":"IF($G55=\"User-defined Measure\",VLOOKUP($H55,Measures!$C$73:$W$77,19,FALSE),IF($D55=\"Hot & Humid\",VLOOKUP($H55,Measures!$C$6:$W$19,19,FALSE),IF($D55=\"Hot & Dry\",VLOOKUP($H55,Measures!$C$20:$W$32,19,FALSE),IF($D55=\"Marine\",VLOOKUP($H55,Measures!$C$33:$W$45,19,FALSE),IF($D55=\"Cold\",VLOOKUP($H55,Measures!$C$46:$W$58,19,FALSE),IF($D55=\"Very Cold\",VLOOKUP($H55,Measures!$C$59:$W$72,19,FALSE),\" \"))))))","v":" "}," "," "," ",{"$f":"IF(B55=0,\" \",PRODUCT(O55,'Emission Factors'!$J$36,E55,I55)/1000)","v":" "}," ","",{"$f":"IF($G55=\"User-defined Measure\",VLOOKUP($H55,Measures!$C$73:$X$77,22,FALSE),IF($D55=\"Hot & Humid\",VLOOKUP($H55,Measures!$C$6:$X$19,22,FALSE),IF($D55=\"Hot & Dry\",VLOOKUP($H55,Measures!$C$20:$X$32,22,FALSE),IF($D55=\"Marine\",VLOOKUP($H55,Measures!$C$33:$X$45,22,FALSE),IF($D55=\"Cold\",VLOOKUP($H55,Measures!$C$46:$X$58,22,FALSE),IF($D55=\"Very Cold\",VLOOKUP($H55,Measures!$C$59:$X$72,22,FALSE),\" \"))))))","v":" "}," ",{"$f":"IF($G55=\"User-defined Measure\",VLOOKUP($H55,Measures!$C$73:$W$77,9,FALSE),IF($D55=\"Hot & Humid\",VLOOKUP($H55,Measures!$C$6:$W$19,9,FALSE),IF($D55=\"Hot & Dry\",VLOOKUP($H55,Measures!$C$20:$W$32,9,FALSE),IF($D55=\"Marine\",VLOOKUP($H55,Measures!$C$33:$W$45,9,FALSE),IF($D55=\"Cold\",VLOOKUP($H55,Measures!$C$46:$W$58,9,FALSE),IF($D55=\"Very Cold\",VLOOKUP($H55,Measures!$C$59:$W$72,9,FALSE),\" \"))))))","v":" "}," ",{"$f":"IF($G55=\"User-defined Measure\",VLOOKUP($H55,Measures!$C$73:$W$77,12,FALSE),IF($D55=\"Hot & Humid\",VLOOKUP($H55,Measures!$C$6:$W$19,12,FALSE),IF($D55=\"Hot & Dry\",VLOOKUP($H55,Measures!$C$20:$W$32,12,FALSE),IF($D55=\"Marine\",VLOOKUP($H55,Measures!$C$33:$W$45,12,FALSE),IF($D55=\"Cold\",VLOOKUP($H55,Measures!$C$46:$W$58,12,FALSE),IF($D55=\"Very Cold\",VLOOKUP($H55,Measures!$C$59:$W$72,12,FALSE),\" \"))))))","v":" "}," "," "," "," "]
[null,null,null,null,null,null,null,null,null,null,null,null,{"$f":"IF(F56<>0,VLOOKUP(F56,'Emission Factors'!$A$4:$J$31,7,FALSE),\" \")","v":" "},{"$f":"IF($G56=\"User-defined Measure\",VLOOKUP($H56,Measures!$C$73:$W$77,16,FALSE),IF($D56=\"Hot & Humid\",VLOOKUP($H56,Measures!$C$6:$W$19,16,FALSE),IF($D56=\"Hot & Dry\",VLOOKUP($H56,Measures!$C$20:$W$32,16,FALSE),IF($D56=\"Marine\",VLOOKUP($H56,Measures!$C$33:$W$45,16,FALSE),IF($D56=\"Cold\",VLOOKUP($H56,Measures!$C$46:$W$58,16,FALSE),IF($D56=\"Very Cold\",VLOOKUP($H56,Measures!$C$59:$W$72,16,FALSE),\" \"))))))","v":" "},{"$f":"IF($G56=\"User-defined Measure\",VLOOKUP($H56,Measures!$C$73:$W$77,19,FALSE),IF($D56=\"Hot & Humid\",VLOOKUP($H56,Measures!$C$6:$W$19,19,FALSE),IF($D56=\"Hot & Dry\",VLOOKUP($H56,Measures!$C$20:$W$32,19,FALSE),IF($D56=\"Marine\",VLOOKUP($H56,Measures!$C$33:$W$45,19,FALSE),IF($D56=\"Cold\",VLOOKUP($H56,Measures!$C$46:$W$58,19,FALSE),IF($D56=\"Very Cold\",VLOOKUP($H56,Measures!$C$59:$W$72,19,FALSE),\" \"))))))","v":" "}," "," "," ",{"$f":"IF(B56=0,\" \",PRODUCT(O56,'Emission Factors'!$J$36,E56,I56)/1000)","v":" "}," ","",{"$f":"IF($G56=\"User-defined Measure\",VLOOKUP($H56,Measures!$C$73:$X$77,22,FALSE),IF($D56=\"Hot & Humid\",VLOOKUP($H56,Measures!$C$6:$X$19,22,FALSE),IF($D56=\"Hot & Dry\",VLOOKUP($H56,Measures!$C$20:$X$32,22,FALSE),IF($D56=\"Marine\",VLOOKUP($H56,Measures!$C$33:$X$45,22,FALSE),IF($D56=\"Cold\",VLOOKUP($H56,Measures!$C$46:$X$58,22,FALSE),IF($D56=\"Very Cold\",VLOOKUP($H56,Measures!$C$59:$X$72,22,FALSE),\" \"))))))","v":" "}," ",{"$f":"IF($G56=\"User-defined Measure\",VLOOKUP($H56,Measures!$C$73:$W$77,9,FALSE),IF($D56=\"Hot & Humid\",VLOOKUP($H56,Measures!$C$6:$W$19,9,FALSE),IF($D56=\"Hot & Dry\",VLOOKUP($H56,Measures!$C$20:$W$32,9,FALSE),IF($D56=\"Marine\",VLOOKUP($H56,Measures!$C$33:$W$45,9,FALSE),IF($D56=\"Cold\",VLOOKUP($H56,Measures!$C$46:$W$58,9,FALSE),IF($D56=\"Very Cold\",VLOOKUP($H56,Measures!$C$59:$W$72,9,FALSE),\" \"))))))","v":" "}," ",{"$f":"IF($G56=\"User-defined Measure\",VLOOKUP($H56,Measures!$C$73:$W$77,12,FALSE),IF($D56=\"Hot & Humid\",VLOOKUP($H56,Measures!$C$6:$W$19,12,FALSE),IF($D56=\"Hot & Dry\",VLOOKUP($H56,Measures!$C$20:$W$32,12,FALSE),IF($D56=\"Marine\",VLOOKUP($H56,Measures!$C$33:$W$45,12,FALSE),IF($D56=\"Cold\",VLOOKUP($H56,Measures!$C$46:$W$58,12,FALSE),IF($D56=\"Very Cold\",VLOOKUP($H56,Measures!$C$59:$W$72,12,FALSE),\" \"))))))","v":" "}," "," "," "," "]
[null,null,null,null,null,null,null,null,null,null,null,null,{"$f":"IF(F57<>0,VLOOKUP(F57,'Emission Factors'!$A$4:$J$31,7,FALSE),\" \")","v":" "},{"$f":"IF($G57=\"User-defined Measure\",VLOOKUP($H57,Measures!$C$73:$W$77,16,FALSE),IF($D57=\"Hot & Humid\",VLOOKUP($H57,Measures!$C$6:$W$19,16,FALSE),IF($D57=\"Hot & Dry\",VLOOKUP($H57,Measures!$C$20:$W$32,16,FALSE),IF($D57=\"Marine\",VLOOKUP($H57,Measures!$C$33:$W$45,16,FALSE),IF($D57=\"Cold\",VLOOKUP($H57,Measures!$C$46:$W$58,16,FALSE),IF($D57=\"Very Cold\",VLOOKUP($H57,Measures!$C$59:$W$72,16,FALSE),\" \"))))))","v":" "},{"$f":"IF($G57=\"User-defined Measure\",VLOOKUP($H57,Measures!$C$73:$W$77,19,FALSE),IF($D57=\"Hot & Humid\",VLOOKUP($H57,Measures!$C$6:$W$19,19,FALSE),IF($D57=\"Hot & Dry\",VLOOKUP($H57,Measures!$C$20:$W$32,19,FALSE),IF($D57=\"Marine\",VLOOKUP($H57,Measures!$C$33:$W$45,19,FALSE),IF($D57=\"Cold\",VLOOKUP($H57,Measures!$C$46:$W$58,19,FALSE),IF($D57=\"Very Cold\",VLOOKUP($H57,Measures!$C$59:$W$72,19,FALSE),\" \"))))))","v":" "}," "," "," ",{"$f":"IF(B57=0,\" \",PRODUCT(O57,'Emission Factors'!$J$36,E57,I57)/1000)","v":" "}," ","",{"$f":"IF($G57=\"User-defined Measure\",VLOOKUP($H57,Measures!$C$73:$X$77,22,FALSE),IF($D57=\"Hot & Humid\",VLOOKUP($H57,Measures!$C$6:$X$19,22,FALSE),IF($D57=\"Hot & Dry\",VLOOKUP($H57,Measures!$C$20:$X$32,22,FALSE),IF($D57=\"Marine\",VLOOKUP($H57,Measures!$C$33:$X$45,22,FALSE),IF($D57=\"Cold\",VLOOKUP($H57,Measures!$C$46:$X$58,22,FALSE),IF($D57=\"Very Cold\",VLOOKUP($H57,Measures!$C$59:$X$72,22,FALSE),\" \"))))))","v":" "}," ",{"$f":"IF($G57=\"User-defined Measure\",VLOOKUP($H57,Measures!$C$73:$W$77,9,FALSE),IF($D57=\"Hot & Humid\",VLOOKUP($H57,Measures!$C$6:$W$19,9,FALSE),IF($D57=\"Hot & Dry\",VLOOKUP($H57,Measures!$C$20:$W$32,9,FALSE),IF($D57=\"Marine\",VLOOKUP($H57,Measures!$C$33:$W$45,9,FALSE),IF($D57=\"Cold\",VLOOKUP($H57,Measures!$C$46:$W$58,9,FALSE),IF($D57=\"Very Cold\",VLOOKUP($H57,Measures!$C$59:$W$72,9,FALSE),\" \"))))))","v":" "}," ",{"$f":"IF($G57=\"User-defined Measure\",VLOOKUP($H57,Measures!$C$73:$W$77,12,FALSE),IF($D57=\"Hot & Humid\",VLOOKUP($H57,Measures!$C$6:$W$19,12,FALSE),IF($D57=\"Hot & Dry\",VLOOKUP($H57,Measures!$C$20:$W$32,12,FALSE),IF($D57=\"Marine\",VLOOKUP($H57,Measures!$C$33:$W$45,12,FALSE),IF($D57=\"Cold\",VLOOKUP($H57,Measures!$C$46:$W$58,12,FALSE),IF($D57=\"Very Cold\",VLOOKUP($H57,Measures!$C$59:$W$72,12,FALSE),\" \"))))))","v":" "}," "," "," "," "]
[null,null,null,null,null,null,null,null,null,null,null,null,{"$f":"IF(F58<>0,VLOOKUP(F58,'Emission Factors'!$A$4:$J$31,7,FALSE),\" \")","v":" "},{"$f":"IF($G58=\"User-defined Measure\",VLOOKUP($H58,Measures!$C$73:$W$77,16,FALSE),IF($D58=\"Hot & Humid\",VLOOKUP($H58,Measures!$C$6:$W$19,16,FALSE),IF($D58=\"Hot & Dry\",VLOOKUP($H58,Measures!$C$20:$W$32,16,FALSE),IF($D58=\"Marine\",VLOOKUP($H58,Measures!$C$33:$W$45,16,FALSE),IF($D58=\"Cold\",VLOOKUP($H58,Measures!$C$46:$W$58,16,FALSE),IF($D58=\"Very Cold\",VLOOKUP($H58,Measures!$C$59:$W$72,16,FALSE),\" \"))))))","v":" "},{"$f":"IF($G58=\"User-defined Measure\",VLOOKUP($H58,Measures!$C$73:$W$77,19,FALSE),IF($D58=\"Hot & Humid\",VLOOKUP($H58,Measures!$C$6:$W$19,19,FALSE),IF($D58=\"Hot & Dry\",VLOOKUP($H58,Measures!$C$20:$W$32,19,FALSE),IF($D58=\"Marine\",VLOOKUP($H58,Measures!$C$33:$W$45,19,FALSE),IF($D58=\"Cold\",VLOOKUP($H58,Measures!$C$46:$W$58,19,FALSE),IF($D58=\"Very Cold\",VLOOKUP($H58,Measures!$C$59:$W$72,19,FALSE),\" \"))))))","v":" "}," "," "," ",{"$f":"IF(B58=0,\" \",PRODUCT(O58,'Emission Factors'!$J$36,E58,I58)/1000)","v":" "}," ","",{"$f":"IF($G58=\"User-defined Measure\",VLOOKUP($H58,Measures!$C$73:$X$77,22,FALSE),IF($D58=\"Hot & Humid\",VLOOKUP($H58,Measures!$C$6:$X$19,22,FALSE),IF($D58=\"Hot & Dry\",VLOOKUP($H58,Measures!$C$20:$X$32,22,FALSE),IF($D58=\"Marine\",VLOOKUP($H58,Measures!$C$33:$X$45,22,FALSE),IF($D58=\"Cold\",VLOOKUP($H58,Measures!$C$46:$X$58,22,FALSE),IF($D58=\"Very Cold\",VLOOKUP($H58,Measures!$C$59:$X$72,22,FALSE),\" \"))))))","v":" "}," ",{"$f":"IF($G58=\"User-defined Measure\",VLOOKUP($H58,Measures!$C$73:$W$77,9,FALSE),IF($D58=\"Hot & Humid\",VLOOKUP($H58,Measures!$C$6:$W$19,9,FALSE),IF($D58=\"Hot & Dry\",VLOOKUP($H58,Measures!$C$20:$W$32,9,FALSE),IF($D58=\"Marine\",VLOOKUP($H58,Measures!$C$33:$W$45,9,FALSE),IF($D58=\"Cold\",VLOOKUP($H58,Measures!$C$46:$W$58,9,FALSE),IF($D58=\"Very Cold\",VLOOKUP($H58,Measures!$C$59:$W$72,9,FALSE),\" \"))))))","v":" "}," ",{"$f":"IF($G58=\"User-defined Measure\",VLOOKUP($H58,Measures!$C$73:$W$77,12,FALSE),IF($D58=\"Hot & Humid\",VLOOKUP($H58,Measures!$C$6:$W$19,12,FALSE),IF($D58=\"Hot & Dry\",VLOOKUP($H58,Measures!$C$20:$W$32,12,FALSE),IF($D58=\"Marine\",VLOOKUP($H58,Measures!$C$33:$W$45,12,FALSE),IF($D58=\"Cold\",VLOOKUP($H58,Measures!$C$46:$W$58,12,FALSE),IF($D58=\"Very Cold\",VLOOKUP($H58,Measures!$C$59:$W$72,12,FALSE),\" \"))))))","v":" "}," "," "," "," "]
[null,null,null,null,null,null,null,null,null,null,null,null,{"$f":"IF(F59<>0,VLOOKUP(F59,'Emission Factors'!$A$4:$J$31,7,FALSE),\" \")","v":" "},{"$f":"IF($G59=\"User-defined Measure\",VLOOKUP($H59,Measures!$C$73:$W$77,16,FALSE),IF($D59=\"Hot & Humid\",VLOOKUP($H59,Measures!$C$6:$W$19,16,FALSE),IF($D59=\"Hot & Dry\",VLOOKUP($H59,Measures!$C$20:$W$32,16,FALSE),IF($D59=\"Marine\",VLOOKUP($H59,Measures!$C$33:$W$45,16,FALSE),IF($D59=\"Cold\",VLOOKUP($H59,Measures!$C$46:$W$58,16,FALSE),IF($D59=\"Very Cold\",VLOOKUP($H59,Measures!$C$59:$W$72,16,FALSE),\" \"))))))","v":" "},{"$f":"IF($G59=\"User-defined Measure\",VLOOKUP($H59,Measures!$C$73:$W$77,19,FALSE),IF($D59=\"Hot & Humid\",VLOOKUP($H59,Measures!$C$6:$W$19,19,FALSE),IF($D59=\"Hot & Dry\",VLOOKUP($H59,Measures!$C$20:$W$32,19,FALSE),IF($D59=\"Marine\",VLOOKUP($H59,Measures!$C$33:$W$45,19,FALSE),IF($D59=\"Cold\",VLOOKUP($H59,Measures!$C$46:$W$58,19,FALSE),IF($D59=\"Very Cold\",VLOOKUP($H59,Measures!$C$59:$W$72,19,FALSE),\" \"))))))","v":" "}," "," "," ",{"$f":"IF(B59=0,\" \",PRODUCT(O59,'Emission Factors'!$J$36,E59,I59)/1000)","v":" "}," ","",{"$f":"IF($G59=\"User-defined Measure\",VLOOKUP($H59,Measures!$C$73:$X$77,22,FALSE),IF($D59=\"Hot & Humid\",VLOOKUP($H59,Measures!$C$6:$X$19,22,FALSE),IF($D59=\"Hot & Dry\",VLOOKUP($H59,Measures!$C$20:$X$32,22,FALSE),IF($D59=\"Marine\",VLOOKUP($H59,Measures!$C$33:$X$45,22,FALSE),IF($D59=\"Cold\",VLOOKUP($H59,Measures!$C$46:$X$58,22,FALSE),IF($D59=\"Very Cold\",VLOOKUP($H59,Measures!$C$59:$X$72,22,FALSE),\" \"))))))","v":" "}," ",{"$f":"IF($G59=\"User-defined Measure\",VLOOKUP($H59,Measures!$C$73:$W$77,9,FALSE),IF($D59=\"Hot & Humid\",VLOOKUP($H59,Measures!$C$6:$W$19,9,FALSE),IF($D59=\"Hot & Dry\",VLOOKUP($H59,Measures!$C$20:$W$32,9,FALSE),IF($D59=\"Marine\",VLOOKUP($H59,Measures!$C$33:$W$45,9,FALSE),IF($D59=\"Cold\",VLOOKUP($H59,Measures!$C$46:$W$58,9,FALSE),IF($D59=\"Very Cold\",VLOOKUP($H59,Measures!$C$59:$W$72,9,FALSE),\" \"))))))","v":" "}," ",{"$f":"IF($G59=\"User-defined Measure\",VLOOKUP($H59,Measures!$C$73:$W$77,12,FALSE),IF($D59=\"Hot & Humid\",VLOOKUP($H59,Measures!$C$6:$W$19,12,FALSE),IF($D59=\"Hot & Dry\",VLOOKUP($H59,Measures!$C$20:$W$32,12,FALSE),IF($D59=\"Marine\",VLOOKUP($H59,Measures!$C$33:$W$45,12,FALSE),IF($D59=\"Cold\",VLOOKUP($H59,Measures!$C$46:$W$58,12,FALSE),IF($D59=\"Very Cold\",VLOOKUP($H59,Measures!$C$59:$W$72,12,FALSE),\" \"))))))","v":" "}," "," "," "," "]
[null,null,null,null,null,null,null,null,null,null,null,null,{"$f":"IF(F60<>0,VLOOKUP(F60,'Emission Factors'!$A$4:$J$31,7,FALSE),\" \")","v":" "},{"$f":"IF($G60=\"User-defined Measure\",VLOOKUP($H60,Measures!$C$73:$W$77,16,FALSE),IF($D60=\"Hot & Humid\",VLOOKUP($H60,Measures!$C$6:$W$19,16,FALSE),IF($D60=\"Hot & Dry\",VLOOKUP($H60,Measures!$C$20:$W$32,16,FALSE),IF($D60=\"Marine\",VLOOKUP($H60,Measures!$C$33:$W$45,16,FALSE),IF($D60=\"Cold\",VLOOKUP($H60,Measures!$C$46:$W$58,16,FALSE),IF($D60=\"Very Cold\",VLOOKUP($H60,Measures!$C$59:$W$72,16,FALSE),\" \"))))))","v":" "},{"$f":"IF($G60=\"User-defined Measure\",VLOOKUP($H60,Measures!$C$73:$W$77,19,FALSE),IF($D60=\"Hot & Humid\",VLOOKUP($H60,Measures!$C$6:$W$19,19,FALSE),IF($D60=\"Hot & Dry\",VLOOKUP($H60,Measures!$C$20:$W$32,19,FALSE),IF($D60=\"Marine\",VLOOKUP($H60,Measures!$C$33:$W$45,19,FALSE),IF($D60=\"Cold\",VLOOKUP($H60,Measures!$C$46:$W$58,19,FALSE),IF($D60=\"Very Cold\",VLOOKUP($H60,Measures!$C$59:$W$72,19,FALSE),\" \"))))))","v":" "}," "," "," ",{"$f":"IF(B60=0,\" \",PRODUCT(O60,'Emission Factors'!$J$36,E60,I60)/1000)","v":" "}," ","",{"$f":"IF($G60=\"User-defined Measure\",VLOOKUP($H60,Measures!$C$73:$X$77,22,FALSE),IF($D60=\"Hot & Humid\",VLOOKUP($H60,Measures!$C$6:$X$19,22,FALSE),IF($D60=\"Hot & Dry\",VLOOKUP($H60,Measures!$C$20:$X$32,22,FALSE),IF($D60=\"Marine\",VLOOKUP($H60,Measures!$C$33:$X$45,22,FALSE),IF($D60=\"Cold\",VLOOKUP($H60,Measures!$C$46:$X$58,22,FALSE),IF($D60=\"Very Cold\",VLOOKUP($H60,Measures!$C$59:$X$72,22,FALSE),\" \"))))))","v":" "}," ",{"$f":"IF($G60=\"User-defined Measure\",VLOOKUP($H60,Measures!$C$73:$W$77,9,FALSE),IF($D60=\"Hot & Humid\",VLOOKUP($H60,Measures!$C$6:$W$19,9,FALSE),IF($D60=\"Hot & Dry\",VLOOKUP($H60,Measures!$C$20:$W$32,9,FALSE),IF($D60=\"Marine\",VLOOKUP($H60,Measures!$C$33:$W$45,9,FALSE),IF($D60=\"Cold\",VLOOKUP($H60,Measures!$C$46:$W$58,9,FALSE),IF($D60=\"Very Cold\",VLOOKUP($H60,Measures!$C$59:$W$72,9,FALSE),\" \"))))))","v":" "}," ",{"$f":"IF($G60=\"User-defined Measure\",VLOOKUP($H60,Measures!$C$73:$W$77,12,FALSE),IF($D60=\"Hot & Humid\",VLOOKUP($H60,Measures!$C$6:$W$19,12,FALSE),IF($D60=\"Hot & Dry\",VLOOKUP($H60,Measures!$C$20:$W$32,12,FALSE),IF($D60=\"Marine\",VLOOKUP($H60,Measures!$C$33:$W$45,12,FALSE),IF($D60=\"Cold\",VLOOKUP($H60,Measures!$C$46:$W$58,12,FALSE),IF($D60=\"Very Cold\",VLOOKUP($H60,Measures!$C$59:$W$72,12,FALSE),\" \"))))))","v":" "}," "," "," "," "]
[null,null,null,null,null,null,null,null,null,null,null,null,{"$f":"IF(F61<>0,VLOOKUP(F61,'Emission Factors'!$A$4:$J$31,7,FALSE),\" \")","v":" "},{"$f":"IF($G61=\"User-defined Measure\",VLOOKUP($H61,Measures!$C$73:$W$77,16,FALSE),IF($D61=\"Hot & Humid\",VLOOKUP($H61,Measures!$C$6:$W$19,16,FALSE),IF($D61=\"Hot & Dry\",VLOOKUP($H61,Measures!$C$20:$W$32,16,FALSE),IF($D61=\"Marine\",VLOOKUP($H61,Measures!$C$33:$W$45,16,FALSE),IF($D61=\"Cold\",VLOOKUP($H61,Measures!$C$46:$W$58,16,FALSE),IF($D61=\"Very Cold\",VLOOKUP($H61,Measures!$C$59:$W$72,16,FALSE),\" \"))))))","v":" "},{"$f":"IF($G61=\"User-defined Measure\",VLOOKUP($H61,Measures!$C$73:$W$77,19,FALSE),IF($D61=\"Hot & Humid\",VLOOKUP($H61,Measures!$C$6:$W$19,19,FALSE),IF($D61=\"Hot & Dry\",VLOOKUP($H61,Measures!$C$20:$W$32,19,FALSE),IF($D61=\"Marine\",VLOOKUP($H61,Measures!$C$33:$W$45,19,FALSE),IF($D61=\"Cold\",VLOOKUP($H61,Measures!$C$46:$W$58,19,FALSE),IF($D61=\"Very Cold\",VLOOKUP($H61,Measures!$C$59:$W$72,19,FALSE),\" \"))))))","v":" "}," "," "," ",{"$f":"IF(B61=0,\" \",PRODUCT(O61,'Emission Factors'!$J$36,E61,I61)/1000)","v":" "}," ","",{"$f":"IF($G61=\"User-defined Measure\",VLOOKUP($H61,Measures!$C$73:$X$77,22,FALSE),IF($D61=\"Hot & Humid\",VLOOKUP($H61,Measures!$C$6:$X$19,22,FALSE),IF($D61=\"Hot & Dry\",VLOOKUP($H61,Measures!$C$20:$X$32,22,FALSE),IF($D61=\"Marine\",VLOOKUP($H61,Measures!$C$33:$X$45,22,FALSE),IF($D61=\"Cold\",VLOOKUP($H61,Measures!$C$46:$X$58,22,FALSE),IF($D61=\"Very Cold\",VLOOKUP($H61,Measures!$C$59:$X$72,22,FALSE),\" \"))))))","v":" "}," ",{"$f":"IF($G61=\"User-defined Measure\",VLOOKUP($H61,Measures!$C$73:$W$77,9,FALSE),IF($D61=\"Hot & Humid\",VLOOKUP($H61,Measures!$C$6:$W$19,9,FALSE),IF($D61=\"Hot & Dry\",VLOOKUP($H61,Measures!$C$20:$W$32,9,FALSE),IF($D61=\"Marine\",VLOOKUP($H61,Measures!$C$33:$W$45,9,FALSE),IF($D61=\"Cold\",VLOOKUP($H61,Measures!$C$46:$W$58,9,FALSE),IF($D61=\"Very Cold\",VLOOKUP($H61,Measures!$C$59:$W$72,9,FALSE),\" \"))))))","v":" "}," ",{"$f":"IF($G61=\"User-defined Measure\",VLOOKUP($H61,Measures!$C$73:$W$77,12,FALSE),IF($D61=\"Hot & Humid\",VLOOKUP($H61,Measures!$C$6:$W$19,12,FALSE),IF($D61=\"Hot & Dry\",VLOOKUP($H61,Measures!$C$20:$W$32,12,FALSE),IF($D61=\"Marine\",VLOOKUP($H61,Measures!$C$33:$W$45,12,FALSE),IF($D61=\"Cold\",VLOOKUP($H61,Measures!$C$46:$W$58,12,FALSE),IF($D61=\"Very Cold\",VLOOKUP($H61,Measures!$C$59:$W$72,12,FALSE),\" \"))))))","v":" "}," "," "," "," "]
[null,null,null,null,null,null,null,null,null,null,null,null,{"$f":"IF(F62<>0,VLOOKUP(F62,'Emission Factors'!$A$4:$J$31,7,FALSE),\" \")","v":" "},{"$f":"IF($G62=\"User-defined Measure\",VLOOKUP($H62,Measures!$C$73:$W$77,16,FALSE),IF($D62=\"Hot & Humid\",VLOOKUP($H62,Measures!$C$6:$W$19,16,FALSE),IF($D62=\"Hot & Dry\",VLOOKUP($H62,Measures!$C$20:$W$32,16,FALSE),IF($D62=\"Marine\",VLOOKUP($H62,Measures!$C$33:$W$45,16,FALSE),IF($D62=\"Cold\",VLOOKUP($H62,Measures!$C$46:$W$58,16,FALSE),IF($D62=\"Very Cold\",VLOOKUP($H62,Measures!$C$59:$W$72,16,FALSE),\" \"))))))","v":" "},{"$f":"IF($G62=\"User-defined Measure\",VLOOKUP($H62,Measures!$C$73:$W$77,19,FALSE),IF($D62=\"Hot & Humid\",VLOOKUP($H62,Measures!$C$6:$W$19,19,FALSE),IF($D62=\"Hot & Dry\",VLOOKUP($H62,Measures!$C$20:$W$32,19,FALSE),IF($D62=\"Marine\",VLOOKUP($H62,Measures!$C$33:$W$45,19,FALSE),IF($D62=\"Cold\",VLOOKUP($H62,Measures!$C$46:$W$58,19,FALSE),IF($D62=\"Very Cold\",VLOOKUP($H62,Measures!$C$59:$W$72,19,FALSE),\" \"))))))","v":" "}," "," "," ",{"$f":"IF(B62=0,\" \",PRODUCT(O62,'Emission Factors'!$J$36,E62,I62)/1000)","v":" "}," ","",{"$f":"IF($G62=\"User-defined Measure\",VLOOKUP($H62,Measures!$C$73:$X$77,22,FALSE),IF($D62=\"Hot & Humid\",VLOOKUP($H62,Measures!$C$6:$X$19,22,FALSE),IF($D62=\"Hot & Dry\",VLOOKUP($H62,Measures!$C$20:$X$32,22,FALSE),IF($D62=\"Marine\",VLOOKUP($H62,Measures!$C$33:$X$45,22,FALSE),IF($D62=\"Cold\",VLOOKUP($H62,Measures!$C$46:$X$58,22,FALSE),IF($D62=\"Very Cold\",VLOOKUP($H62,Measures!$C$59:$X$72,22,FALSE),\" \"))))))","v":" "}," ",{"$f":"IF($G62=\"User-defined Measure\",VLOOKUP($H62,Measures!$C$73:$W$77,9,FALSE),IF($D62=\"Hot & Humid\",VLOOKUP($H62,Measures!$C$6:$W$19,9,FALSE),IF($D62=\"Hot & Dry\",VLOOKUP($H62,Measures!$C$20:$W$32,9,FALSE),IF($D62=\"Marine\",VLOOKUP($H62,Measures!$C$33:$W$45,9,FALSE),IF($D62=\"Cold\",VLOOKUP($H62,Measures!$C$46:$W$58,9,FALSE),IF($D62=\"Very Cold\",VLOOKUP($H62,Measures!$C$59:$W$72,9,FALSE),\" \"))))))","v":" "}," ",{"$f":"IF($G62=\"User-defined Measure\",VLOOKUP($H62,Measures!$C$73:$W$77,12,FALSE),IF($D62=\"Hot & Humid\",VLOOKUP($H62,Measures!$C$6:$W$19,12,FALSE),IF($D62=\"Hot & Dry\",VLOOKUP($H62,Measures!$C$20:$W$32,12,FALSE),IF($D62=\"Marine\",VLOOKUP($H62,Measures!$C$33:$W$45,12,FALSE),IF($D62=\"Cold\",VLOOKUP($H62,Measures!$C$46:$W$58,12,FALSE),IF($D62=\"Very Cold\",VLOOKUP($H62,Measures!$C$59:$W$72,12,FALSE),\" \"))))))","v":" "}," "," "," "," "]
[null,null,null,null,null,null,null,null,null,null,null,null,{"$f":"IF(F63<>0,VLOOKUP(F63,'Emission Factors'!$A$4:$J$31,7,FALSE),\" \")","v":" "},{"$f":"IF($G63=\"User-defined Measure\",VLOOKUP($H63,Measures!$C$73:$W$77,16,FALSE),IF($D63=\"Hot & Humid\",VLOOKUP($H63,Measures!$C$6:$W$19,16,FALSE),IF($D63=\"Hot & Dry\",VLOOKUP($H63,Measures!$C$20:$W$32,16,FALSE),IF($D63=\"Marine\",VLOOKUP($H63,Measures!$C$33:$W$45,16,FALSE),IF($D63=\"Cold\",VLOOKUP($H63,Measures!$C$46:$W$58,16,FALSE),IF($D63=\"Very Cold\",VLOOKUP($H63,Measures!$C$59:$W$72,16,FALSE),\" \"))))))","v":" "},{"$f":"IF($G63=\"User-defined Measure\",VLOOKUP($H63,Measures!$C$73:$W$77,19,FALSE),IF($D63=\"Hot & Humid\",VLOOKUP($H63,Measures!$C$6:$W$19,19,FALSE),IF($D63=\"Hot & Dry\",VLOOKUP($H63,Measures!$C$20:$W$32,19,FALSE),IF($D63=\"Marine\",VLOOKUP($H63,Measures!$C$33:$W$45,19,FALSE),IF($D63=\"Cold\",VLOOKUP($H63,Measures!$C$46:$W$58,19,FALSE),IF($D63=\"Very Cold\",VLOOKUP($H63,Measures!$C$59:$W$72,19,FALSE),\" \"))))))","v":" "}," "," "," ",{"$f":"IF(B63=0,\" \",PRODUCT(O63,'Emission Factors'!$J$36,E63,I63)/1000)","v":" "}," ","",{"$f":"IF($G63=\"User-defined Measure\",VLOOKUP($H63,Measures!$C$73:$X$77,22,FALSE),IF($D63=\"Hot & Humid\",VLOOKUP($H63,Measures!$C$6:$X$19,22,FALSE),IF($D63=\"Hot & Dry\",VLOOKUP($H63,Measures!$C$20:$X$32,22,FALSE),IF($D63=\"Marine\",VLOOKUP($H63,Measures!$C$33:$X$45,22,FALSE),IF($D63=\"Cold\",VLOOKUP($H63,Measures!$C$46:$X$58,22,FALSE),IF($D63=\"Very Cold\",VLOOKUP($H63,Measures!$C$59:$X$72,22,FALSE),\" \"))))))","v":" "}," ",{"$f":"IF($G63=\"User-defined Measure\",VLOOKUP($H63,Measures!$C$73:$W$77,9,FALSE),IF($D63=\"Hot & Humid\",VLOOKUP($H63,Measures!$C$6:$W$19,9,FALSE),IF($D63=\"Hot & Dry\",VLOOKUP($H63,Measures!$C$20:$W$32,9,FALSE),IF($D63=\"Marine\",VLOOKUP($H63,Measures!$C$33:$W$45,9,FALSE),IF($D63=\"Cold\",VLOOKUP($H63,Measures!$C$46:$W$58,9,FALSE),IF($D63=\"Very Cold\",VLOOKUP($H63,Measures!$C$59:$W$72,9,FALSE),\" \"))))))","v":" "}," ",{"$f":"IF($G63=\"User-defined Measure\",VLOOKUP($H63,Measures!$C$73:$W$77,12,FALSE),IF($D63=\"Hot & Humid\",VLOOKUP($H63,Measures!$C$6:$W$19,12,FALSE),IF($D63=\"Hot & Dry\",VLOOKUP($H63,Measures!$C$20:$W$32,12,FALSE),IF($D63=\"Marine\",VLOOKUP($H63,Measures!$C$33:$W$45,12,FALSE),IF($D63=\"Cold\",VLOOKUP($H63,Measures!$C$46:$W$58,12,FALSE),IF($D63=\"Very Cold\",VLOOKUP($H63,Measures!$C$59:$W$72,12,FALSE),\" \"))))))","v":" "}," "," "," "," "]
[null,null,null,null,null,null,null,null,null,null,null,null,{"$f":"IF(F64<>0,VLOOKUP(F64,'Emission Factors'!$A$4:$J$31,7,FALSE),\" \")","v":" "},{"$f":"IF($G64=\"User-defined Measure\",VLOOKUP($H64,Measures!$C$73:$W$77,16,FALSE),IF($D64=\"Hot & Humid\",VLOOKUP($H64,Measures!$C$6:$W$19,16,FALSE),IF($D64=\"Hot & Dry\",VLOOKUP($H64,Measures!$C$20:$W$32,16,FALSE),IF($D64=\"Marine\",VLOOKUP($H64,Measures!$C$33:$W$45,16,FALSE),IF($D64=\"Cold\",VLOOKUP($H64,Measures!$C$46:$W$58,16,FALSE),IF($D64=\"Very Cold\",VLOOKUP($H64,Measures!$C$59:$W$72,16,FALSE),\" \"))))))","v":" "},{"$f":"IF($G64=\"User-defined Measure\",VLOOKUP($H64,Measures!$C$73:$W$77,19,FALSE),IF($D64=\"Hot & Humid\",VLOOKUP($H64,Measures!$C$6:$W$19,19,FALSE),IF($D64=\"Hot & Dry\",VLOOKUP($H64,Measures!$C$20:$W$32,19,FALSE),IF($D64=\"Marine\",VLOOKUP($H64,Measures!$C$33:$W$45,19,FALSE),IF($D64=\"Cold\",VLOOKUP($H64,Measures!$C$46:$W$58,19,FALSE),IF($D64=\"Very Cold\",VLOOKUP($H64,Measures!$C$59:$W$72,19,FALSE),\" \"))))))","v":" "}," "," "," ",{"$f":"IF(B64=0,\" \",PRODUCT(O64,'Emission Factors'!$J$36,E64,I64)/1000)","v":" "}," ","",{"$f":"IF($G64=\"User-defined Measure\",VLOOKUP($H64,Measures!$C$73:$X$77,22,FALSE),IF($D64=\"Hot & Humid\",VLOOKUP($H64,Measures!$C$6:$X$19,22,FALSE),IF($D64=\"Hot & Dry\",VLOOKUP($H64,Measures!$C$20:$X$32,22,FALSE),IF($D64=\"Marine\",VLOOKUP($H64,Measures!$C$33:$X$45,22,FALSE),IF($D64=\"Cold\",VLOOKUP($H64,Measures!$C$46:$X$58,22,FALSE),IF($D64=\"Very Cold\",VLOOKUP($H64,Measures!$C$59:$X$72,22,FALSE),\" \"))))))","v":" "}," ",{"$f":"IF($G64=\"User-defined Measure\",VLOOKUP($H64,Measures!$C$73:$W$77,9,FALSE),IF($D64=\"Hot & Humid\",VLOOKUP($H64,Measures!$C$6:$W$19,9,FALSE),IF($D64=\"Hot & Dry\",VLOOKUP($H64,Measures!$C$20:$W$32,9,FALSE),IF($D64=\"Marine\",VLOOKUP($H64,Measures!$C$33:$W$45,9,FALSE),IF($D64=\"Cold\",VLOOKUP($H64,Measures!$C$46:$W$58,9,FALSE),IF($D64=\"Very Cold\",VLOOKUP($H64,Measures!$C$59:$W$72,9,FALSE),\" \"))))))","v":" "}," ",{"$f":"IF($G64=\"User-defined Measure\",VLOOKUP($H64,Measures!$C$73:$W$77,12,FALSE),IF($D64=\"Hot & Humid\",VLOOKUP($H64,Measures!$C$6:$W$19,12,FALSE),IF($D64=\"Hot & Dry\",VLOOKUP($H64,Measures!$C$20:$W$32,12,FALSE),IF($D64=\"Marine\",VLOOKUP($H64,Measures!$C$33:$W$45,12,FALSE),IF($D64=\"Cold\",VLOOKUP($H64,Measures!$C$46:$W$58,12,FALSE),IF($D64=\"Very Cold\",VLOOKUP($H64,Measures!$C$59:$W$72,12,FALSE),\" \"))))))","v":" "}," "," "," "," "]
[null,null,null,null,null,null,null,null,null,null,null,null,{"$f":"IF(F65<>0,VLOOKUP(F65,'Emission Factors'!$A$4:$J$31,7,FALSE),\" \")","v":" "},{"$f":"IF($G65=\"User-defined Measure\",VLOOKUP($H65,Measures!$C$73:$W$77,16,FALSE),IF($D65=\"Hot & Humid\",VLOOKUP($H65,Measures!$C$6:$W$19,16,FALSE),IF($D65=\"Hot & Dry\",VLOOKUP($H65,Measures!$C$20:$W$32,16,FALSE),IF($D65=\"Marine\",VLOOKUP($H65,Measures!$C$33:$W$45,16,FALSE),IF($D65=\"Cold\",VLOOKUP($H65,Measures!$C$46:$W$58,16,FALSE),IF($D65=\"Very Cold\",VLOOKUP($H65,Measures!$C$59:$W$72,16,FALSE),\" \"))))))","v":" "},{"$f":"IF($G65=\"User-defined Measure\",VLOOKUP($H65,Measures!$C$73:$W$77,19,FALSE),IF($D65=\"Hot & Humid\",VLOOKUP($H65,Measures!$C$6:$W$19,19,FALSE),IF($D65=\"Hot & Dry\",VLOOKUP($H65,Measures!$C$20:$W$32,19,FALSE),IF($D65=\"Marine\",VLOOKUP($H65,Measures!$C$33:$W$45,19,FALSE),IF($D65=\"Cold\",VLOOKUP($H65,Measures!$C$46:$W$58,19,FALSE),IF($D65=\"Very Cold\",VLOOKUP($H65,Measures!$C$59:$W$72,19,FALSE),\" \"))))))","v":" "}," "," "," ",{"$f":"IF(B65=0,\" \",PRODUCT(O65,'Emission Factors'!$J$36,E65,I65)/1000)","v":" "}," ","",{"$f":"IF($G65=\"User-defined Measure\",VLOOKUP($H65,Measures!$C$73:$X$77,22,FALSE),IF($D65=\"Hot & Humid\",VLOOKUP($H65,Measures!$C$6:$X$19,22,FALSE),IF($D65=\"Hot & Dry\",VLOOKUP($H65,Measures!$C$20:$X$32,22,FALSE),IF($D65=\"Marine\",VLOOKUP($H65,Measures!$C$33:$X$45,22,FALSE),IF($D65=\"Cold\",VLOOKUP($H65,Measures!$C$46:$X$58,22,FALSE),IF($D65=\"Very Cold\",VLOOKUP($H65,Measures!$C$59:$X$72,22,FALSE),\" \"))))))","v":" "}," ",{"$f":"IF($G65=\"User-defined Measure\",VLOOKUP($H65,Measures!$C$73:$W$77,9,FALSE),IF($D65=\"Hot & Humid\",VLOOKUP($H65,Measures!$C$6:$W$19,9,FALSE),IF($D65=\"Hot & Dry\",VLOOKUP($H65,Measures!$C$20:$W$32,9,FALSE),IF($D65=\"Marine\",VLOOKUP($H65,Measures!$C$33:$W$45,9,FALSE),IF($D65=\"Cold\",VLOOKUP($H65,Measures!$C$46:$W$58,9,FALSE),IF($D65=\"Very Cold\",VLOOKUP($H65,Measures!$C$59:$W$72,9,FALSE),\" \"))))))","v":" "}," ",{"$f":"IF($G65=\"User-defined Measure\",VLOOKUP($H65,Measures!$C$73:$W$77,12,FALSE),IF($D65=\"Hot & Humid\",VLOOKUP($H65,Measures!$C$6:$W$19,12,FALSE),IF($D65=\"Hot & Dry\",VLOOKUP($H65,Measures!$C$20:$W$32,12,FALSE),IF($D65=\"Marine\",VLOOKUP($H65,Measures!$C$33:$W$45,12,FALSE),IF($D65=\"Cold\",VLOOKUP($H65,Measures!$C$46:$W$58,12,FALSE),IF($D65=\"Very Cold\",VLOOKUP($H65,Measures!$C$59:$W$72,12,FALSE),\" \"))))))","v":" "}," "," "," "," "]
[null,null,null,null,null,null,null,null,null,null,null,null,{"$f":"IF(F66<>0,VLOOKUP(F66,'Emission Factors'!$A$4:$J$31,7,FALSE),\" \")","v":" "},{"$f":"IF($G66=\"User-defined Measure\",VLOOKUP($H66,Measures!$C$73:$W$77,16,FALSE),IF($D66=\"Hot & Humid\",VLOOKUP($H66,Measures!$C$6:$W$19,16,FALSE),IF($D66=\"Hot & Dry\",VLOOKUP($H66,Measures!$C$20:$W$32,16,FALSE),IF($D66=\"Marine\",VLOOKUP($H66,Measures!$C$33:$W$45,16,FALSE),IF($D66=\"Cold\",VLOOKUP($H66,Measures!$C$46:$W$58,16,FALSE),IF($D66=\"Very Cold\",VLOOKUP($H66,Measures!$C$59:$W$72,16,FALSE),\" \"))))))","v":" "},{"$f":"IF($G66=\"User-defined Measure\",VLOOKUP($H66,Measures!$C$73:$W$77,19,FALSE),IF($D66=\"Hot & Humid\",VLOOKUP($H66,Measures!$C$6:$W$19,19,FALSE),IF($D66=\"Hot & Dry\",VLOOKUP($H66,Measures!$C$20:$W$32,19,FALSE),IF($D66=\"Marine\",VLOOKUP($H66,Measures!$C$33:$W$45,19,FALSE),IF($D66=\"Cold\",VLOOKUP($H66,Measures!$C$46:$W$58,19,FALSE),IF($D66=\"Very Cold\",VLOOKUP($H66,Measures!$C$59:$W$72,19,FALSE),\" \"))))))","v":" "}," "," "," ",{"$f":"IF(B66=0,\" \",PRODUCT(O66,'Emission Factors'!$J$36,E66,I66)/1000)","v":" "}," ","",{"$f":"IF($G66=\"User-defined Measure\",VLOOKUP($H66,Measures!$C$73:$X$77,22,FALSE),IF($D66=\"Hot & Humid\",VLOOKUP($H66,Measures!$C$6:$X$19,22,FALSE),IF($D66=\"Hot & Dry\",VLOOKUP($H66,Measures!$C$20:$X$32,22,FALSE),IF($D66=\"Marine\",VLOOKUP($H66,Measures!$C$33:$X$45,22,FALSE),IF($D66=\"Cold\",VLOOKUP($H66,Measures!$C$46:$X$58,22,FALSE),IF($D66=\"Very Cold\",VLOOKUP($H66,Measures!$C$59:$X$72,22,FALSE),\" \"))))))","v":" "}," ",{"$f":"IF($G66=\"User-defined Measure\",VLOOKUP($H66,Measures!$C$73:$W$77,9,FALSE),IF($D66=\"Hot & Humid\",VLOOKUP($H66,Measures!$C$6:$W$19,9,FALSE),IF($D66=\"Hot & Dry\",VLOOKUP($H66,Measures!$C$20:$W$32,9,FALSE),IF($D66=\"Marine\",VLOOKUP($H66,Measures!$C$33:$W$45,9,FALSE),IF($D66=\"Cold\",VLOOKUP($H66,Measures!$C$46:$W$58,9,FALSE),IF($D66=\"Very Cold\",VLOOKUP($H66,Measures!$C$59:$W$72,9,FALSE),\" \"))))))","v":" "}," ",{"$f":"IF($G66=\"User-defined Measure\",VLOOKUP($H66,Measures!$C$73:$W$77,12,FALSE),IF($D66=\"Hot & Humid\",VLOOKUP($H66,Measures!$C$6:$W$19,12,FALSE),IF($D66=\"Hot & Dry\",VLOOKUP($H66,Measures!$C$20:$W$32,12,FALSE),IF($D66=\"Marine\",VLOOKUP($H66,Measures!$C$33:$W$45,12,FALSE),IF($D66=\"Cold\",VLOOKUP($H66,Measures!$C$46:$W$58,12,FALSE),IF($D66=\"Very Cold\",VLOOKUP($H66,Measures!$C$59:$W$72,12,FALSE),\" \"))))))","v":" "}," "," "," "," "]
[null,null,null,null,null,null,null,null,null,null,null,null,{"$f":"IF(F67<>0,VLOOKUP(F67,'Emission Factors'!$A$4:$J$31,7,FALSE),\" \")","v":" "},{"$f":"IF($G67=\"User-defined Measure\",VLOOKUP($H67,Measures!$C$73:$W$77,16,FALSE),IF($D67=\"Hot & Humid\",VLOOKUP($H67,Measures!$C$6:$W$19,16,FALSE),IF($D67=\"Hot & Dry\",VLOOKUP($H67,Measures!$C$20:$W$32,16,FALSE),IF($D67=\"Marine\",VLOOKUP($H67,Measures!$C$33:$W$45,16,FALSE),IF($D67=\"Cold\",VLOOKUP($H67,Measures!$C$46:$W$58,16,FALSE),IF($D67=\"Very Cold\",VLOOKUP($H67,Measures!$C$59:$W$72,16,FALSE),\" \"))))))","v":" "},{"$f":"IF($G67=\"User-defined Measure\",VLOOKUP($H67,Measures!$C$73:$W$77,19,FALSE),IF($D67=\"Hot & Humid\",VLOOKUP($H67,Measures!$C$6:$W$19,19,FALSE),IF($D67=\"Hot & Dry\",VLOOKUP($H67,Measures!$C$20:$W$32,19,FALSE),IF($D67=\"Marine\",VLOOKUP($H67,Measures!$C$33:$W$45,19,FALSE),IF($D67=\"Cold\",VLOOKUP($H67,Measures!$C$46:$W$58,19,FALSE),IF($D67=\"Very Cold\",VLOOKUP($H67,Measures!$C$59:$W$72,19,FALSE),\" \"))))))","v":" "}," "," "," ",{"$f":"IF(B67=0,\" \",PRODUCT(O67,'Emission Factors'!$J$36,E67,I67)/1000)","v":" "}," ","",{"$f":"IF($G67=\"User-defined Measure\",VLOOKUP($H67,Measures!$C$73:$X$77,22,FALSE),IF($D67=\"Hot & Humid\",VLOOKUP($H67,Measures!$C$6:$X$19,22,FALSE),IF($D67=\"Hot & Dry\",VLOOKUP($H67,Measures!$C$20:$X$32,22,FALSE),IF($D67=\"Marine\",VLOOKUP($H67,Measures!$C$33:$X$45,22,FALSE),IF($D67=\"Cold\",VLOOKUP($H67,Measures!$C$46:$X$58,22,FALSE),IF($D67=\"Very Cold\",VLOOKUP($H67,Measures!$C$59:$X$72,22,FALSE),\" \"))))))","v":" "}," ",{"$f":"IF($G67=\"User-defined Measure\",VLOOKUP($H67,Measures!$C$73:$W$77,9,FALSE),IF($D67=\"Hot & Humid\",VLOOKUP($H67,Measures!$C$6:$W$19,9,FALSE),IF($D67=\"Hot & Dry\",VLOOKUP($H67,Measures!$C$20:$W$32,9,FALSE),IF($D67=\"Marine\",VLOOKUP($H67,Measures!$C$33:$W$45,9,FALSE),IF($D67=\"Cold\",VLOOKUP($H67,Measures!$C$46:$W$58,9,FALSE),IF($D67=\"Very Cold\",VLOOKUP($H67,Measures!$C$59:$W$72,9,FALSE),\" \"))))))","v":" "}," ",{"$f":"IF($G67=\"User-defined Measure\",VLOOKUP($H67,Measures!$C$73:$W$77,12,FALSE),IF($D67=\"Hot & Humid\",VLOOKUP($H67,Measures!$C$6:$W$19,12,FALSE),IF($D67=\"Hot & Dry\",VLOOKUP($H67,Measures!$C$20:$W$32,12,FALSE),IF($D67=\"Marine\",VLOOKUP($H67,Measures!$C$33:$W$45,12,FALSE),IF($D67=\"Cold\",VLOOKUP($H67,Measures!$C$46:$W$58,12,FALSE),IF($D67=\"Very Cold\",VLOOKUP($H67,Measures!$C$59:$W$72,12,FALSE),\" \"))))))","v":" "}," "," "," "," "]
[null,null,null,null,null,null,null,null,null,null,null,null,{"$f":"IF(F68<>0,VLOOKUP(F68,'Emission Factors'!$A$4:$J$31,7,FALSE),\" \")","v":" "},{"$f":"IF($G68=\"User-defined Measure\",VLOOKUP($H68,Measures!$C$73:$W$77,16,FALSE),IF($D68=\"Hot & Humid\",VLOOKUP($H68,Measures!$C$6:$W$19,16,FALSE),IF($D68=\"Hot & Dry\",VLOOKUP($H68,Measures!$C$20:$W$32,16,FALSE),IF($D68=\"Marine\",VLOOKUP($H68,Measures!$C$33:$W$45,16,FALSE),IF($D68=\"Cold\",VLOOKUP($H68,Measures!$C$46:$W$58,16,FALSE),IF($D68=\"Very Cold\",VLOOKUP($H68,Measures!$C$59:$W$72,16,FALSE),\" \"))))))","v":" "},{"$f":"IF($G68=\"User-defined Measure\",VLOOKUP($H68,Measures!$C$73:$W$77,19,FALSE),IF($D68=\"Hot & Humid\",VLOOKUP($H68,Measures!$C$6:$W$19,19,FALSE),IF($D68=\"Hot & Dry\",VLOOKUP($H68,Measures!$C$20:$W$32,19,FALSE),IF($D68=\"Marine\",VLOOKUP($H68,Measures!$C$33:$W$45,19,FALSE),IF($D68=\"Cold\",VLOOKUP($H68,Measures!$C$46:$W$58,19,FALSE),IF($D68=\"Very Cold\",VLOOKUP($H68,Measures!$C$59:$W$72,19,FALSE),\" \"))))))","v":" "}," "," "," ",{"$f":"IF(B68=0,\" \",PRODUCT(O68,'Emission Factors'!$J$36,E68,I68)/1000)","v":" "}," ","",{"$f":"IF($G68=\"User-defined Measure\",VLOOKUP($H68,Measures!$C$73:$X$77,22,FALSE),IF($D68=\"Hot & Humid\",VLOOKUP($H68,Measures!$C$6:$X$19,22,FALSE),IF($D68=\"Hot & Dry\",VLOOKUP($H68,Measures!$C$20:$X$32,22,FALSE),IF($D68=\"Marine\",VLOOKUP($H68,Measures!$C$33:$X$45,22,FALSE),IF($D68=\"Cold\",VLOOKUP($H68,Measures!$C$46:$X$58,22,FALSE),IF($D68=\"Very Cold\",VLOOKUP($H68,Measures!$C$59:$X$72,22,FALSE),\" \"))))))","v":" "}," ",{"$f":"IF($G68=\"User-defined Measure\",VLOOKUP($H68,Measures!$C$73:$W$77,9,FALSE),IF($D68=\"Hot & Humid\",VLOOKUP($H68,Measures!$C$6:$W$19,9,FALSE),IF($D68=\"Hot & Dry\",VLOOKUP($H68,Measures!$C$20:$W$32,9,FALSE),IF($D68=\"Marine\",VLOOKUP($H68,Measures!$C$33:$W$45,9,FALSE),IF($D68=\"Cold\",VLOOKUP($H68,Measures!$C$46:$W$58,9,FALSE),IF($D68=\"Very Cold\",VLOOKUP($H68,Measures!$C$59:$W$72,9,FALSE),\" \"))))))","v":" "}," ",{"$f":"IF($G68=\"User-defined Measure\",VLOOKUP($H68,Measures!$C$73:$W$77,12,FALSE),IF($D68=\"Hot & Humid\",VLOOKUP($H68,Measures!$C$6:$W$19,12,FALSE),IF($D68=\"Hot & Dry\",VLOOKUP($H68,Measures!$C$20:$W$32,12,FALSE),IF($D68=\"Marine\",VLOOKUP($H68,Measures!$C$33:$W$45,12,FALSE),IF($D68=\"Cold\",VLOOKUP($H68,Measures!$C$46:$W$58,12,FALSE),IF($D68=\"Very Cold\",VLOOKUP($H68,Measures!$C$59:$W$72,12,FALSE),\" \"))))))","v":" "}," "," "," "," "]
[]
[null,"NOTES:"]
[null,"1Climate types defined in the Advanced Energy Retrofit Guides. Corresponds with climate zones defined by Commercial Buildings Energy Consumption Survey (CBECS) at http://www.eia.gov/emeu/cbecs/climate_zones.html. Map included on the \"References\" tab of this worksheet."]
[null,"2eGRID region defined by the EPA at http://www.epa.gov/cleanenergy/energy-resources/egrid/index.html. eGRID data are upgraded periodically; data corresponds with eGRID 2012 (2009 year data). Map included on the \"References\" tab of this worksheet."]
[null,"3RCx corresponds with EBCx in the Advanced Energy Retrofit Guides. Major Renovations corresponds with Deep Retrofit."]

{"sheet":"Summary","index":2,"n_rows":72,"n_cols":12,"rows_kept":72,"cut":false,"hidden":false,"merged":[[7,9,7,10],[8,9,8,10],[7,7,7,8],[8,7,8,8],[1,1,1,4],[2,1,2,4],[7,3,7,4],[8,3,8,4]]}
[null,"Summary of Building Emissions: Reduction Opportunities"]
[null,"Agency:",null,null,null,{"$f":"Input!H3","v":"ABC"}]
[null,"Baseline Scope 1 & 2 Emissions:",null,null,null,{"$f":"Input!H4","v":40305755}]
[]
[]
[null,"Agency Totals"]
[]
[null,"Agency Name","Annual GHG Reduction Potential (MTCO2e/year)","Cumulative GHG Reduction Potential (MTCO2e)",null,"Capital Cost ($)","Annual Cost Savings ($/year)","Simple Payback\n(years)",null,"Cost Effectiveness ($/MTCO2e)",null,"GHG Percent Reduction from Baseline (%)"]
[null,{"$f":"F2","v":"ABC"},{"$f":"Input!T10","v":4183.7092057328009},{"$f":"Input!W10","v":83378.417959151586},null,{"$f":"Input!Y10","v":5766675.4000000004},{"$f":"Input!AA10","v":2160640},{"$f":"F9/G9","v":2.6689663247926543},null,{"$f":"F9/D9","v":69.162686713787096},null,{"$f":"C9/F3","v":1.0379930125940578E-4}]
[]
[null,"Program Totals"]
[null,"Up to 10 programs can be summarized in the following table.  If more programs are desired, insert additional rows, and copy and paste the formulas into the new rows.  "]
[null,"Program Name","Annual GHG Reduction Potential (MTCO2e/year)","Cumulative GHG Reduction Potential (MTCO2e)","Rank \n(on GHG Reduction Potential)","Capital Cost ($)","Annual Cost Savings ($/year)","Simple Payback\n(years)","Rank \n(on Simple Payback)","Cost Effectiveness ($/MTCO2e)","Rank\n(on Cost Effectiveness)","GHG Percent Reduction from Baseline (%)"]
[null,{"$f":"IF(OR('Pivot Tables'!A3=0,'Pivot Tables'!A3=\"(blank)\",'Pivot Tables'!A3=\"Grand Total\"), \" \",'Pivot Tables'!A3)","v":"Program B"},{"$f":"IF($B14=\" \",\" \",'Pivot Tables'!B3)","v":4183.7092057328009},{"$f":"IF($B14=\" \",\" \",'Pivot Tables'!E3)","v":83378.417959151586},{"$f":"IF(B14=\" \",\" \",RANK(C14,C$14:C$23,1))","v":1},{"$f":"IF(B14=\" \",\" \",'Pivot Tables'!C3)","v":5766675.4000000004},{"$f":"IF(B14=\" \",\" \",'Pivot Tables'!D3)","v":2160640},{"$f":"IF(C14=\" \",\" \",F14/G14)","v":2.6689663247926543},{"$f":"IF(B14=\" \",\" \",RANK(H14,H$14:H$23,1))","v":1},{"$f":"IF(B14=\" \",\" \",F14/D14)","v":69.162686713787096},{"$f":"IF(B14=\" \",\" \",RANK(J14,J$14:J$23,1))","v":1},{"$f":"IF(C14=\" \",\" \",C14/F$3)","v":1.0379930125940578E-4}]
[null,{"$f":"IF(OR('Pivot Tables'!A4=0,'Pivot Tables'!A4=\"(blank)\",'Pivot Tables'!A4=\"Grand Total\"), \" \",'Pivot Tables'!A4)","v":" "},{"$f":"IF(B15=\" \",\" \",'Pivot Tables'!B4)","v":" "},{"$f":"IF($B15=\" \",\" \",'Pivot Tables'!E4)","v":" "},{"$f":"IF(B15=\" \",\" \",RANK(C15,C$14:C$23,1))","v":" "},{"$f":"IF(B15=\" \",\" \",'Pivot Tables'!C4)","v":" "},{"$f":"IF(B15=\" \",\" \",'Pivot Tables'!D4)","v":" "}," "," ",{"$f":"IF(B15=\" \",\" \",F15/D15)","v":" "},{"$f":"IF(B15=\" \",\" \",RANK(J15,J$14:J$23,1))","v":" "}," "]
[null,{"$f":"IF(OR('Pivot Tables'!A5=0,'Pivot Tables'!A5=\"(blank)\",'Pivot Tables'!A5=\"Grand Total\"), \" \",'Pivot Tables'!A5)","v":" "},{"$f":"IF(B16=\" \",\" \",'Pivot Tables'!B5)","v":" "},{"$f":"IF($B16=\" \",\" \",'Pivot Tables'!E5)","v":" "}," ",{"$f":"IF(B16=\" \",\" \",'Pivot Tables'!C5)","v":" "},{"$f":"IF(B16=\" \",\" \",'Pivot Tables'!D5)","v":" "}," "," "," "," "," "]
[null,{"$f":"IF(OR('Pivot Tables'!A6=0,'Pivot Tables'!A6=\"(blank)\",'Pivot Tables'!A6=\"Grand Total\"), \" \",'Pivot Tables'!A6)","v":" "},{"$f":"IF(B17=\" \",\" \",'Pivot Tables'!B6)","v":" "},{"$f":"IF($B17=\" \",\" \",'Pivot Tables'!E6)","v":" "}," ",{"$f":"IF(B17=\" \",\" \",'Pivot Tables'!C6)","v":" "},{"$f":"IF(B17=\" \",\" \",'Pivot Tables'!D6)","v":" "}," "," "," "," "," "]
[null,{"$f":"IF(OR('Pivot Tables'!A7=0,'Pivot Tables'!A7=\"(blank)\",'Pivot Tables'!A7=\"Grand Total\"), \" \",'Pivot Tables'!A7)","v":" "},{"$f":"IF(B18=\" \",\" \",'Pivot Tables'!B7)","v":" "},{"$f":"IF($B18=\" \",\" \",'Pivot Tables'!E7)","v":" "}," ",{"$f":"IF(B18=\" \",\" \",'Pivot Tables'!C7)","v":" "},{"$f":"IF(B18=\" \",\" \",'Pivot Tables'!D7)","v":" "}," "," "," "," "," "]
[null,{"$f":"IF(OR('Pivot Tables'!A8=0,'Pivot Tables'!A8=\"(blank)\",'Pivot Tables'!A8=\"Grand Total\"), \" \",'Pivot Tables'!A8)","v":" "},{"$f":"IF(B19=\" \",\" \",'Pivot Tables'!B8)","v":" "},{"$f":"IF($B19=\" \",\" \",'Pivot Tables'!E8)","v":" "}," ",{"$f":"IF(B19=\" \",\" \",'Pivot Tables'!C8)","v":" "},{"$f":"IF(B19=\" \",\" \",'Pivot Tables'!D8)","v":" "}," "," "," "," "," "]
[null,{"$f":"IF(OR('Pivot Tables'!A9=0,'Pivot Tables'!A9=\"(blank)\",'Pivot Tables'!A9=\"Grand Total\"), \" \",'Pivot Tables'!A9)","v":" "},{"$f":"IF(B20=\" \",\" \",'Pivot Tables'!B9)","v":" "},{"$f":"IF($B20=\" \",\" \",'Pivot Tables'!E9)","v":" "}," ",{"$f":"IF(B20=\" \",\" \",'Pivot Tables'!C9)","v":" "},{"$f":"IF(B20=\" \",\" \",'Pivot Tables'!D9)","v":" "}," "," "," "," "," "]
[null,{"$f":"IF(OR('Pivot Tables'!A20=0,'Pivot Tables'!A20=\"(blank)\",'Pivot Tables'!A20=\"Grand Total\"), \" \",'Pivot Tables'!A20)","v":" "},{"$f":"IF(B21=\" \",\" \",'Pivot Tables'!B20)","v":" "},{"$f":"IF($B21=\" \",\" \",'Pivot Tables'!E10)","v":" "}," ",{"$f":"IF(B21=\" \",\" \",'Pivot Tables'!C10)","v":" "},{"$f":"IF(B21=\" \",\" \",'Pivot Tables'!D10)","v":" "}," "," "," "," "," "]
[null,{"$f":"IF(OR('Pivot Tables'!A20=0,'Pivot Tables'!A20=\"(blank)\",'Pivot Tables'!A20=\"Grand Total\"), \" \",'Pivot Tables'!A20)","v":" "},{"$f":"IF(B22=\" \",\" \",'Pivot Tables'!B21)","v":" "},{"$f":"IF($B22=\" \",\" \",'Pivot Tables'!E11)","v":" "}," ",{"$f":"IF(B22=\" \",\" \",'Pivot Tables'!C11)","v":" "},{"$f":"IF(B22=\" \",\" \",'Pivot Tables'!D11)","v":" "}," "," "," "," "," "]
[null,{"$f":"IF(OR('Pivot Tables'!A21=0,'Pivot Tables'!A21=\"(blank)\",'Pivot Tables'!A21=\"Grand Total\"), \" \",'Pivot Tables'!A21)","v":" "},{"$f":"IF(B23=\" \",\" \",'Pivot Tables'!B23)","v":" "},{"$f":"IF($B23=\" \",\" \",'Pivot Tables'!E12)","v":" "}," ",{"$f":"IF(B23=\" \",\" \",'Pivot Tables'!C12)","v":" "},{"$f":"IF(B23=\" \",\" \",'Pivot Tables'!D12)","v":" "}," "," "," "," "," "]
[]
[null,"Site Totals"]
[null,"Up to 15 sites can be summarized in the following table.  If more sites are desired, insert additional rows, and copy and paste the formulas into the new rows.  "]
[null,"Site Name","GHG Reduction Potential (MTCO2e/year)","Cumulative GHG Reduction Potential (MTCO2e)","Rank \n(on GHG Reduction Potential)","Capital Cost ($)","Annual Cost Savings ($/year)","Simple Payback\n(years)","Rank \n(on Simple Payback)","Cost Effectiveness ($/MTCO2e)","Rank\n(on Cost Effectiveness)","GHG Percent Reduction from Baseline (%)"]
[null,{"$f":"IF(OR('Pivot Tables'!A26=0,'Pivot Tables'!A26=\"(blank)\",'Pivot Tables'!A26=\"Grand Total\"), \" \",'Pivot Tables'!A26)","v":"Site 2"},{"$f":"IF($B28=\" \",\" \",'Pivot Tables'!B26)","v":2073.1872745177852},{"$f":"IF($B28=\" \",\" \",'Pivot Tables'!E26)","v":41198.148805316108},{"$f":"IF(B28=\" \",\" \",(RANK(C28,C$28:C$42,0)))","v":1},{"$f":"IF(E28=\" \",\" \",'Pivot Tables'!C26)","v":1420175},{"$f":"IF(B28=\" \",\" \",'Pivot Tables'!D26)","v":939750},{"$f":"IF(B28=\" \",\" \",F28/G28)","v":1.5112263899973397},{"$f":"IF(B28=\" \",\" \",RANK(H28,H$28:H$42,1))","v":1},{"$f":"IF(B28=\" \",\" \",F28/D28)","v":34.471815874812904},{"$f":"IF(B28=\" \",\" \",RANK(J28,J$28:J$42,1))","v":1},{"$f":"IF(B28=\" \",\" \",C28/$F$3)","v":5.1436507628198137E-5}]
[null,{"$f":"IF(OR('Pivot Tables'!A27=0,'Pivot Tables'!A27=\"(blank)\",'Pivot Tables'!A27=\"Grand Total\"), \" \",'Pivot Tables'!A27)","v":"Site 3"},{"$f":"IF(B29=\" \",\" \",'Pivot Tables'!B27)","v":804.07436515574091},{"$f":"IF($B29=\" \",\" \",'Pivot Tables'!E27)","v":16051.317832649956},3,{"$f":"IF(E29=\" \",\" \",'Pivot Tables'!C27)","v":2164100.4},{"$f":"IF(B29=\" \",\" \",'Pivot Tables'!D27)","v":602140},3.5940153452685419,3,{"$f":"IF(B29=\" \",\" \",F29/D29)","v":134.82384577782187},{"$f":"IF(B29=\" \",\" \",RANK(J29,J$28:J$42,1))","v":3},1.9949368648614593E-5]
[null,{"$f":"IF(OR('Pivot Tables'!A28=0,'Pivot Tables'!A28=\"(blank)\",'Pivot Tables'!A28=\"Grand Total\"), \" \",'Pivot Tables'!A28)","v":"Site 4"},{"$f":"IF(B30=\" \",\" \",'Pivot Tables'!B28)","v":1306.4475660592755},{"$f":"IF($B30=\" \",\" \",'Pivot Tables'!E28)","v":26128.951321185508},2,{"$f":"IF(E30=\" \",\" \",'Pivot Tables'!C28)","v":2182400},{"$f":"IF(B30=\" \",\" \",'Pivot Tables'!D28)","v":618750},3.5271111111111111,2,83.524209340559992,2,3.2413424982593065E-5]
[null,{"$f":"IF(OR('Pivot Tables'!A29=0,'Pivot Tables'!A29=\"(blank)\",'Pivot Tables'!A29=\"Grand Total\"), \" \",'Pivot Tables'!A29)","v":" "},{"$f":"IF(B31=\" \",\" \",'Pivot Tables'!B29)","v":" "},{"$f":"IF($B31=\" \",\" \",'Pivot Tables'!E29)","v":" "}," ",{"$f":"IF(E31=\" \",\" \",'Pivot Tables'!C29)","v":" "},{"$f":"IF(B31=\" \",\" \",'Pivot Tables'!D29)","v":" "}," "," "," "," "," "]
[null,{"$f":"IF(OR('Pivot Tables'!A30=0,'Pivot Tables'!A30=\"(blank)\",'Pivot Tables'!A30=\"Grand Total\"), \" \",'Pivot Tables'!A30)","v":" "},{"$f":"IF(B32=\" \",\" \",'Pivot Tables'!B30)","v":" "},{"$f":"IF($B32=\" \",\" \",'Pivot Tables'!E30)","v":" "}," ",{"$f":"IF(E32=\" \",\" \",'Pivot Tables'!C30)","v":" "},{"$f":"IF(B32=\" \",\" \",'Pivot Tables'!D30)","v":" "}," "," "," "," "," "]
[null,{"$f":"IF(OR('Pivot Tables'!A31=0,'Pivot Tables'!A31=\"(blank)\",'Pivot Tables'!A31=\"Grand Total\"), \" \",'Pivot Tables'!A31)","v":" "},{"$f":"IF(B33=\" \",\" \",'Pivot Tables'!B31)","v":" "},{"$f":"IF($B33=\" \",\" \",'Pivot Tables'!E31)","v":" "}," ",{"$f":"IF(E33=\" \",\" \",'Pivot Tables'!C31)","v":" "},{"$f":"IF(B33=\" \",\" \",'Pivot Tables'!D31)","v":" "}," "," "," "," "," "]
[null,{"$f":"IF(OR('Pivot Tables'!A32=0,'Pivot Tables'!A32=\"(blank)\",'Pivot Tables'!A32=\"Grand Total\"), \" \",'Pivot Tables'!A32)","v":" "},{"$f":"IF(B34=\" \",\" \",'Pivot Tables'!B32)","v":" "},{"$f":"IF($B34=\" \",\" \",'Pivot Tables'!E32)","v":" "},{"$f":"IF(B34=\" \",\" \",(RANK(C34,C$28:C$42,0)))","v":" "},{"$f":"IF(E34=\" \",\" \",'Pivot Tables'!C32)","v":" "},{"$f":"IF(B34=\" \",\" \",'Pivot Tables'!D32)","v":" "}," "," "," "," "," "]
[null,{"$f":"IF(OR('Pivot Tables'!A33=0,'Pivot Tables'!A33=\"(blank)\",'Pivot Tables'!A33=\"Grand Total\"), \" \",'Pivot Tables'!A33)","v":" "},{"$f":"IF(B35=\" \",\" \",'Pivot Tables'!B33)","v":" "},{"$f":"IF($B35=\" \",\" \",'Pivot Tables'!E33)","v":" "}," ",{"$f":"IF(E35=\" \",\" \",'Pivot Tables'!C33)","v":" "},{"$f":"IF(B35=\" \",\" \",'Pivot Tables'!D33)","v":" "}," "," "," "," "," "]
[null,{"$f":"IF(OR('Pivot Tables'!A34=0,'Pivot Tables'!A34=\"(blank)\",'Pivot Tables'!A34=\"Grand Total\"), \" \",'Pivot Tables'!A34)","v":" "},{"$f":"IF(B36=\" \",\" \",'Pivot Tables'!B34)","v":" "},{"$f":"IF($B36=\" \",\" \",'Pivot Tables'!E34)","v":" "}," ",{"$f":"IF(E36=\" \",\" \",'Pivot Tables'!C34)","v":" "},{"$f":"IF(B36=\" \",\" \",'Pivot Tables'!D34)","v":" "}," "," "," "," "," "]
[null,{"$f":"IF(OR('Pivot Tables'!A35=0,'Pivot Tables'!A35=\"(blank)\",'Pivot Tables'!A35=\"Grand Total\"), \" \",'Pivot Tables'!A35)","v":" "},{"$f":"IF(B37=\" \",\" \",'Pivot Tables'!B35)","v":" "},{"$f":"IF($B37=\" \",\" \",'Pivot Tables'!E35)","v":" "}," ",{"$f":"IF(E37=\" \",\" \",'Pivot Tables'!C35)","v":" "},{"$f":"IF(B37=\" \",\" \",'Pivot Tables'!D35)","v":" "}," "," "," "," "," "]
[null,{"$f":"IF(OR('Pivot Tables'!A57=0,'Pivot Tables'!A57=\"(blank)\",'Pivot Tables'!A57=\"Grand Total\"), \" \",'Pivot Tables'!A57)","v":" "},{"$f":"IF(B38=\" \",\" \",'Pivot Tables'!B57)","v":" "},{"$f":"IF($B38=\" \",\" \",'Pivot Tables'!E36)","v":" "}," ",{"$f":"IF(E38=\" \",\" \",'Pivot Tables'!C36)","v":" "},{"$f":"IF(B38=\" \",\" \",'Pivot Tables'!D36)","v":" "}," "," "," "," "," "]
[null,{"$f":"IF(OR('Pivot Tables'!A58=0,'Pivot Tables'!A58=\"(blank)\",'Pivot Tables'!A58=\"Grand Total\"), \" \",'Pivot Tables'!A58)","v":" "},{"$f":"IF(B39=\" \",\" \",'Pivot Tables'!B58)","v":" "},{"$f":"IF($B39=\" \",\" \",'Pivot Tables'!E37)","v":" "}," ",{"$f":"IF(E39=\" \",\" \",'Pivot Tables'!C37)","v":" "},{"$f":"IF(B39=\" \",\" \",'Pivot Tables'!D37)","v":" "}," "," "," "," "," "]
[null,{"$f":"IF(OR('Pivot Tables'!A59=0,'Pivot Tables'!A59=\"(blank)\",'Pivot Tables'!A59=\"Grand Total\"), \" \",'Pivot Tables'!A59)","v":" "},{"$f":"IF(B40=\" \",\" \",'Pivot Tables'!B59)","v":" "},{"$f":"IF($B40=\" \",\" \",'Pivot Tables'!E38)","v":" "}," ",{"$f":"IF(E40=\" \",\" \",'Pivot Tables'!C38)","v":" "},{"$f":"IF(B40=\" \",\" \",'Pivot Tables'!D38)","v":" "}," "," "," "," "," "]
[null,{"$f":"IF(OR('Pivot Tables'!A60=0,'Pivot Tables'!A60=\"(blank)\",'Pivot Tables'!A60=\"Grand Total\"), \" \",'Pivot Tables'!A60)","v":" "},{"$f":"IF(B41=\" \",\" \",'Pivot Tables'!B60)","v":" "},{"$f":"IF($B41=\" \",\" \",'Pivot Tables'!E39)","v":" "}," ",{"$f":"IF(E41=\" \",\" \",'Pivot Tables'!C39)","v":" "},{"$f":"IF(B41=\" \",\" \",'Pivot Tables'!D39)","v":" "}," "," "," "," "," "]
[null,{"$f":"IF(OR('Pivot Tables'!A61=0,'Pivot Tables'!A61=\"(blank)\",'Pivot Tables'!A61=\"Grand Total\"), \" \",'Pivot Tables'!A61)","v":" "},{"$f":"IF(B42=\" \",\" \",'Pivot Tables'!B61)","v":" "},{"$f":"IF($B42=\" \",\" \",'Pivot Tables'!E40)","v":" "}," ",{"$f":"IF(E42=\" \",\" \",'Pivot Tables'!C40)","v":" "},{"$f":"IF(B42=\" \",\" \",'Pivot Tables'!D40)","v":" "}," "," "," "," "," "]
[]
[]
[null,"Measure Totals"]
[null,"Up to 25 measures can be summarized in the following table.  If more measures are desired, insert additional rows, and copy and paste the formulas into the new rows.  "]
[null,"Measure","GHG Reduction Potential (MTCO2e/year)","Cumulative GHG Reduction Potential (MTCO2e)","Rank \n(on GHG Reduction Potential)","Capital Cost ($)","Annual Cost Savings ($/year)","Simple Payback\n(years)","Rank \n(on Simple Payback)","Cost Effectiveness ($/MTCO2e)","Rank\n(on Cost Effectiveness)","GHG Percent Reduction from Baseline (%)"]
[null,{"$f":"IF(OR('Pivot Tables'!A69=0,'Pivot Tables'!A69=\"(blank)\",'Pivot Tables'!A69=\"Grand Total\"), \" \",'Pivot Tables'!A69)","v":"Install IR heating"},{"$f":"IF($B48=\" \",\" \",'Pivot Tables'!B69)","v":26.559668503959866},{"$f":"IF($B48=\" \",\" \",'Pivot Tables'!E69)","v":265.59668503959864},{"$f":"IF(B48=\" \",\" \",RANK(C48,C$48:C$72,0))","v":4},{"$f":"IF(B48=\" \",\" \",'Pivot Tables'!C69)","v":20000},{"$f":"IF(B48=\" \",\" \",'Pivot Tables'!D69)","v":6000},{"$f":"IF(B48=\" \",\" \",F48/G48)","v":3.3333333333333335},{"$f":"IF(B48=\" \",\" \",RANK(H48,H$48:H$72,1))","v":3},{"$f":"IF(B48=\" \",\" \",F48/D48)","v":75.302144667272998},{"$f":"IF(B48=\" \",\" \",RANK(J48,J$48:J$72,1))","v":2},{"$f":"IF(B48=\" \",\" \",C48/$F$3)","v":6.589547448983369E-7}]
[null,{"$f":"IF(OR('Pivot Tables'!A70=0,'Pivot Tables'!A70=\"(blank)\",'Pivot Tables'!A70=\"Grand Total\"), \" \",'Pivot Tables'!A70)","v":"Major Renovation (Deep Retrofit) Package"},{"$f":"IF(B49=\" \",\" \",'Pivot Tables'!B70)","v":690.45464381997795},{"$f":"IF($B49=\" \",\" \",'Pivot Tables'!E70)","v":13809.09287639956},{"$f":"IF(B49=\" \",\" \",RANK(C49,C$48:C$72,0))","v":3},{"$f":"IF(B49=\" \",\" \",'Pivot Tables'!C70)","v":2123550},{"$f":"IF(B49=\" \",\" \",'Pivot Tables'!D70)","v":361350},5.8767123287671232,4,{"$f":"IF(B49=\" \",\" \",F49/D49)","v":153.77910909913965},{"$f":"IF(B49=\" \",\" \",RANK(J49,J$48:J$72,1))","v":4},1.7130423281240557E-5]
[null,{"$f":"IF(OR('Pivot Tables'!A71=0,'Pivot Tables'!A71=\"(blank)\",'Pivot Tables'!A71=\"Grand Total\"), \" \",'Pivot Tables'!A71)","v":"RCx (EBCx) Package"},{"$f":"IF(B50=\" \",\" \",'Pivot Tables'!B71)","v":1964.5549836112345},{"$f":"IF($B50=\" \",\" \",'Pivot Tables'!E71)","v":39291.099672224693},1,{"$f":"IF(B50=\" \",\" \",'Pivot Tables'!C71)","v":748475},{"$f":"IF(B50=\" \",\" \",'Pivot Tables'!D71)","v":685650},1.091628381827463,1,19.04947955755754,1,4.8741302169162555E-5]
[null,{"$f":"IF(OR('Pivot Tables'!A72=0,'Pivot Tables'!A72=\"(blank)\",'Pivot Tables'!A72=\"Grand Total\"), \" \",'Pivot Tables'!A72)","v":"Standard Retrofit Package"},{"$f":"IF(B51=\" \",\" \",'Pivot Tables'!B72)","v":1496.1060157046568},{"$f":"IF($B51=\" \",\" \",'Pivot Tables'!E72)","v":29922.120314093132},2,{"$f":"IF(B51=\" \",\" \",'Pivot Tables'!C72)","v":2649850},{"$f":"IF(B51=\" \",\" \",'Pivot Tables'!D72)","v":1085200},2.4418079616660524,2,88.558229570112957,3,3.7118918023112497E-5]
[null,{"$f":"IF(OR('Pivot Tables'!A73=0,'Pivot Tables'!A73=\"(blank)\",'Pivot Tables'!A73=\"Grand Total\"), \" \",'Pivot Tables'!A73)","v":" "},{"$f":"IF(B52=\" \",\" \",'Pivot Tables'!B73)","v":" "},{"$f":"IF($B52=\" \",\" \",'Pivot Tables'!E73)","v":" "}," ",{"$f":"IF(B52=\" \",\" \",'Pivot Tables'!C73)","v":" "},{"$f":"IF(B52=\" \",\" \",'Pivot Tables'!D73)","v":" "}," "," "," "," "," "]
[null,{"$f":"IF(OR('Pivot Tables'!A74=0,'Pivot Tables'!A74=\"(blank)\",'Pivot Tables'!A74=\"Grand Total\"), \" \",'Pivot Tables'!A74)","v":"Replace the tenant server room cooling units with more efficient units"},{"$f":"IF(B53=\" \",\" \",'Pivot Tables'!B74)","v":6.0338940929727585},{"$f":"IF($B53=\" \",\" \",'Pivot Tables'!E74)","v":90.508411394591377},5,{"$f":"IF(B53=\" \",\" \",'Pivot Tables'!C74)","v":224800.40000000002},{"$f":"IF(B53=\" \",\" \",'Pivot Tables'!D74)","v":22440},10.017843137254903,5,2483.751471671877,5,1.4970304099185733E-7]
[null,{"$f":"IF(OR('Pivot Tables'!A75=0,'Pivot Tables'!A75=\"(blank)\",'Pivot Tables'!A75=\"Grand Total\"), \" \",'Pivot Tables'!A75)","v":" "},{"$f":"IF(B54=\" \",\" \",'Pivot Tables'!B75)","v":" "},{"$f":"IF($B54=\" \",\" \",'Pivot Tables'!E75)","v":" "}," ",{"$f":"IF(B54=\" \",\" \",'Pivot Tables'!C75)","v":" "},{"$f":"IF(B54=\" \",\" \",'Pivot Tables'!D75)","v":" "}," "," "," "," "," "]
[null,{"$f":"IF(OR('Pivot Tables'!A76=0,'Pivot Tables'!A76=\"(blank)\",'Pivot Tables'!A76=\"Grand Total\"), \" \",'Pivot Tables'!A76)","v":" "},{"$f":"IF(B55=\" \",\" \",'Pivot Tables'!B76)","v":" "},{"$f":"IF($B55=\" \",\" \",'Pivot Tables'!E76)","v":" "}," ",{"$f":"IF(B55=\" \",\" \",'Pivot Tables'!C76)","v":" "},{"$f":"IF(B55=\" \",\" \",'Pivot Tables'!D76)","v":" "}," "," "," "," "," "]
[null,{"$f":"IF(OR('Pivot Tables'!A77=0,'Pivot Tables'!A77=\"(blank)\",'Pivot Tables'!A77=\"Grand Total\"), \" \",'Pivot Tables'!A77)","v":" "},{"$f":"IF(B56=\" \",\" \",'Pivot Tables'!B77)","v":" "},{"$f":"IF($B56=\" \",\" \",'Pivot Tables'!E77)","v":" "}," ",{"$f":"IF(B56=\" \",\" \",'Pivot Tables'!C77)","v":" "},{"$f":"IF(B56=\" \",\" \",'Pivot Tables'!D77)","v":" "}," "," "," "," "," "]
[null,{"$f":"IF(OR('Pivot Tables'!A78=0,'Pivot Tables'!A78=\"(blank)\",'Pivot Tables'!A78=\"Grand Total\"), \" \",'Pivot Tables'!A78)","v":" "},{"$f":"IF(B57=\" \",\" \",'Pivot Tables'!B78)","v":" "},{"$f":"IF($B57=\" \",\" \",'Pivot Tables'!E78)","v":" "}," ",{"$f":"IF(B57=\" \",\" \",'Pivot Tables'!C78)","v":" "},{"$f":"IF(B57=\" \",\" \",'Pivot Tables'!D78)","v":" "}," "," "," "," "," "]
[null,{"$f":"IF(OR('Pivot Tables'!A79=0,'Pivot Tables'!A79=\"(blank)\",'Pivot Tables'!A79=\"Grand Total\"), \" \",'Pivot Tables'!A79)","v":" "},{"$f":"IF(B58=\" \",\" \",'Pivot Tables'!B79)","v":" "},{"$f":"IF($B58=\" \",\" \",'Pivot Tables'!E79)","v":" "}," ",{"$f":"IF(B58=\" \",\" \",'Pivot Tables'!C79)","v":" "},{"$f":"IF(B58=\" \",\" \",'Pivot Tables'!D79)","v":" "}," "," "," "," "," "]
[null,{"$f":"IF(OR('Pivot Tables'!A80=0,'Pivot Tables'!A80=\"(blank)\",'Pivot Tables'!A80=\"Grand Total\"), \" \",'Pivot Tables'!A80)","v":" "},{"$f":"IF(B59=\" \",\" \",'Pivot Tables'!B80)","v":" "},{"$f":"IF($B59=\" \",\" \",'Pivot Tables'!E80)","v":" "}," ",{"$f":"IF(B59=\" \",\" \",'Pivot Tables'!C80)","v":" "},{"$f":"IF(B59=\" \",\" \",'Pivot Tables'!D80)","v":" "}," "," "," "," ",{"$f":"IF(B59=\" \",\" \",C59/$F$3)","v":" "}]
[null,{"$f":"IF(OR('Pivot Tables'!A81=0,'Pivot Tables'!A81=\"(blank)\",'Pivot Tables'!A81=\"Grand Total\"), \" \",'Pivot Tables'!A81)","v":" "},{"$f":"IF(B60=\" \",\" \",'Pivot Tables'!B81)","v":" "},{"$f":"IF($B60=\" \",\" \",'Pivot Tables'!E81)","v":" "}," ",{"$f":"IF(B60=\" \",\" \",'Pivot Tables'!C81)","v":" "},{"$f":"IF(B60=\" \",\" \",'Pivot Tables'!D81)","v":" "}," "," "," "," "," "]
[null,{"$f":"IF(OR('Pivot Tables'!A82=0,'Pivot Tables'!A82=\"(blank)\",'Pivot Tables'!A82=\"Grand Total\"), \" \",'Pivot Tables'!A82)","v":" "},{"$f":"IF(B61=\" \",\" \",'Pivot Tables'!B82)","v":" "},{"$f":"IF($B61=\" \",\" \",'Pivot Tables'!E82)","v":" "}," ",{"$f":"IF(B61=\" \",\" \",'Pivot Tables'!C82)","v":" "},{"$f":"IF(B61=\" \",\" \",'Pivot Tables'!D82)","v":" "}," "," "," "," "," "]
[null,{"$f":"IF(OR('Pivot Tables'!A83=0,'Pivot Tables'!A83=\"(blank)\",'Pivot Tables'!A83=\"Grand Total\"), \" \",'Pivot Tables'!A83)","v":" "},{"$f":"IF(B62=\" \",\" \",'Pivot Tables'!B83)","v":" "},{"$f":"IF($B62=\" \",\" \",'Pivot Tables'!E83)","v":" "}," ",{"$f":"IF(B62=\" \",\" \",'Pivot Tables'!C83)","v":" "},{"$f":"IF(B62=\" \",\" \",'Pivot Tables'!D83)","v":" "}," "," "," "," "," "]
[null,{"$f":"IF(OR('Pivot Tables'!A84=0,'Pivot Tables'!A84=\"(blank)\",'Pivot Tables'!A84=\"Grand Total\"), \" \",'Pivot Tables'!A84)","v":" "},{"$f":"IF(B63=\" \",\" \",'Pivot Tables'!B84)","v":" "},{"$f":"IF($B63=\" \",\" \",'Pivot Tables'!E84)","v":" "}," ",{"$f":"IF(B63=\" \",\" \",'Pivot Tables'!C84)","v":" "},{"$f":"IF(B63=\" \",\" \",'Pivot Tables'!D84)","v":" "}," "," "," "," "," "]
[null,{"$f":"IF(OR('Pivot Tables'!A85=0,'Pivot Tables'!A85=\"(blank)\",'Pivot Tables'!A85=\"Grand Total\"), \" \",'Pivot Tables'!A85)","v":" "},{"$f":"IF(B64=\" \",\" \",'Pivot Tables'!B85)","v":" "},{"$f":"IF($B64=\" \",\" \",'Pivot Tables'!E85)","v":" "}," ",{"$f":"IF(B64=\" \",\" \",'Pivot Tables'!C85)","v":" "},{"$f":"IF(B64=\" \",\" \",'Pivot Tables'!D85)","v":" "}," "," "," "," "," "]
[null,{"$f":"IF(OR('Pivot Tables'!A86=0,'Pivot Tables'!A86=\"(blank)\",'Pivot Tables'!A86=\"Grand Total\"), \" \",'Pivot Tables'!A86)","v":" "},{"$f":"IF(B65=\" \",\" \",'Pivot Tables'!B86)","v":" "},{"$f":"IF($B65=\" \",\" \",'Pivot Tables'!E86)","v":" "}," ",{"$f":"IF(B65=\" \",\" \",'Pivot Tables'!C86)","v":" "},{"$f":"IF(B65=\" \",\" \",'Pivot Tables'!D86)","v":" "}," "," "," "," "," "]
[null,{"$f":"IF(OR('Pivot Tables'!A87=0,'Pivot Tables'!A87=\"(blank)\",'Pivot Tables'!A87=\"Grand Total\"), \" \",'Pivot Tables'!A87)","v":" "},{"$f":"IF(B66=\" \",\" \",'Pivot Tables'!B87)","v":" "},{"$f":"IF($B66=\" \",\" \",'Pivot Tables'!E87)","v":" "}," ",{"$f":"IF(B66=\" \",\" \",'Pivot Tables'!C87)","v":" "},{"$f":"IF(B66=\" \",\" \",'Pivot Tables'!D87)","v":" "}," "," "," "," "," "]
[null,{"$f":"IF(OR('Pivot Tables'!A88=0,'Pivot Tables'!A88=\"(blank)\",'Pivot Tables'!A88=\"Grand Total\"), \" \",'Pivot Tables'!A88)","v":" "},{"$f":"IF(B67=\" \",\" \",'Pivot Tables'!B88)","v":" "},{"$f":"IF($B67=\" \",\" \",'Pivot Tables'!E88)","v":" "}," ",{"$f":"IF(B67=\" \",\" \",'Pivot Tables'!C88)","v":" "},{"$f":"IF(B67=\" \",\" \",'Pivot Tables'!D88)","v":" "}," "," "," "," "," "]
[null,{"$f":"IF(OR('Pivot Tables'!A89=0,'Pivot Tables'!A89=\"(blank)\",'Pivot Tables'!A89=\"Grand Total\"), \" \",'Pivot Tables'!A89)","v":" "},{"$f":"IF(B68=\" \",\" \",'Pivot Tables'!B89)","v":" "},{"$f":"IF($B68=\" \",\" \",'Pivot Tables'!E89)","v":" "}," ",{"$f":"IF(B68=\" \",\" \",'Pivot Tables'!C89)","v":" "},{"$f":"IF(B68=\" \",\" \",'Pivot Tables'!D89)","v":" "}," "," "," "," "," "]
[null,{"$f":"IF(OR('Pivot Tables'!A90=0,'Pivot Tables'!A90=\"(blank)\",'Pivot Tables'!A90=\"Grand Total\"), \" \",'Pivot Tables'!A90)","v":" "},{"$f":"IF(B69=\" \",\" \",'Pivot Tables'!B90)","v":" "},{"$f":"IF($B69=\" \",\" \",'Pivot Tables'!E90)","v":" "}," ",{"$f":"IF(B69=\" \",\" \",'Pivot Tables'!C90)","v":" "},{"$f":"IF(B69=\" \",\" \",'Pivot Tables'!D90)","v":" "}," "," "," "," "," "]
[null,{"$f":"IF(OR('Pivot Tables'!A91=0,'Pivot Tables'!A91=\"(blank)\",'Pivot Tables'!A91=\"Grand Total\"), \" \",'Pivot Tables'!A91)","v":" "},{"$f":"IF(B70=\" \",\" \",'Pivot Tables'!B91)","v":" "},{"$f":"IF($B70=\" \",\" \",'Pivot Tables'!E91)","v":" "}," ",{"$f":"IF(B70=\" \",\" \",'Pivot Tables'!C91)","v":" "},{"$f":"IF(B70=\" \",\" \",'Pivot Tables'!D91)","v":" "}," "," "," "," "," "]
[null,{"$f":"IF(OR('Pivot Tables'!A92=0,'Pivot Tables'!A92=\"(blank)\",'Pivot Tables'!A92=\"Grand Total\"), \" \",'Pivot Tables'!A92)","v":" "},{"$f":"IF(B71=\" \",\" \",'Pivot Tables'!B92)","v":" "},{"$f":"IF($B71=\" \",\" \",'Pivot Tables'!E92)","v":" "}," ",{"$f":"IF(B71=\" \",\" \",'Pivot Tables'!C92)","v":" "},{"$f":"IF(B71=\" \",\" \",'Pivot Tables'!D92)","v":" "}," "," "," "," "," "]
[null,{"$f":"IF(OR('Pivot Tables'!A93=0,'Pivot Tables'!A93=\"(blank)\",'Pivot Tables'!A93=\"Grand Total\"), \" \",'Pivot Tables'!A93)","v":" "},{"$f":"IF(B72=\" \",\" \",'Pivot Tables'!B93)","v":" "},{"$f":"IF($B72=\" \",\" \",'Pivot Tables'!E93)","v":" "}," ",{"$f":"IF(B72=\" \",\" \",'Pivot Tables'!C93)","v":" "},{"$f":"IF(B72=\" \",\" \",'Pivot Tables'!D93)","v":" "}," "," "," "," "," "]

{"sheet":"Graphs","index":3,"n_rows":0,"n_cols":0,"rows_kept":0,"cut":false,"hidden":false,"merged":[]}

{"sheet":"Measures","index":4,"n_rows":77,"n_cols":24,"rows_kept":77,"cut":false,"hidden":false,"merged":[[1,1,2,1]]}
[]
[null,"Office","Default Proxy Bldg Size",200000,"SF"]
[null,null,"User-defined Proxy Bldg Size",200000,"SF"]
[null,"VLOOKUP",1,2,3,4,5,6,7,8,9,10,11,12,13,14,15,16,17,18,19,20,21,22]
["Building Type","Retrofit Number","Retrofit Description","Climate","Measure Costs ($)","Energy Cost Savings ($)","O&M Cost Savings ($)","Total Savings ($)","Simple Payback (Years)","Net Present Value","Measure Cost Index ($/sf)","Energy Savings Index ($/sf)","O&M Savings Index ($/sf)","Total Savings  Index ($/sf)","NPV Index ($/sf)","Electric energy savings (kWh)","Electric energy savings Index (kWh/SF)","Electric energy savings Index (kBtu/SF)","Electric demand savings (kW)","Gas savings (therms)","Gas Savings Index (kBtu/SF)","EUI reduction (kBtu/sf)","Savings as % of total site usage","Effective Useful Life"]
["Office",1,"RCx (EBCx) Package","Hot & Humid",61100,36300,0,36300,2,244000,{"$f":"E6/$D$2","v":0.30549999999999999},0.18149999999999999,{"$f":"IF(G6<>0,G6/$D$2,0)","v":0},{"$f":"H6/$D$2","v":0.18149999999999999},{"$f":"J6/$D$2","v":1.22},319000,{"$f":"P6/$D$2","v":1.595},{"$f":"Q6*'Emission Factors'!$L$1/1000","v":5.4421400000000002},4,16000,{"$f":"IF(T6<>0,T6*100/$D$2,0)","v":8},13,0.15,20]
["Office",2,"Standard Retrofit Package","Hot & Humid",422000,141000,-4100,137000,3,753000,2.11,0.70499999999999996,{"$f":"IF(G7<>0,G7/$D$2,0)","v":-2.0500000000000001E-2},{"$f":"H7/$D$2","v":0.68500000000000005},3.7650000000000001,900000,4.5,{"$f":"Q7*'Emission Factors'!$L$1/1000","v":15.353999999999999},170,28000,14,29,0.33,20]
["Office",3,"Major Renovation (Deep Retrofit) Package","Hot & Humid",697000,115000,1500,117000,6,227000,3.4849999999999999,0.57499999999999996,{"$f":"IF(G8<>0,G8/$D$2,0)","v":7.4999999999999997E-3},{"$f":"H8/$D$2","v":0.58499999999999996},1.135,1520000,7.6,{"$f":"Q8*'Emission Factors'!$L$1/1000","v":25.931199999999997},290,28000,14,40,0.45,20]
[]
["Office",4,"Install occupancy sensors for lighting","Hot & Humid",75609,9792,-652,9140,8,11485,{"$f":"E10/$D$2","v":0.37804500000000002},{"$f":"F10/$D$2","v":4.8959999999999997E-2},{"$f":"IF(G10<>0,G10/$D$2,0)","v":-3.2599999999999999E-3},{"$f":"H10/$D$2","v":4.5699999999999998E-2},5.7424999999999997E-2,108944,0.54471999999999998,{"$f":"Q10*'Emission Factors'!$L$1/1000","v":1.8585846400000001},32,-1174,-0.58699999999999997,1.3,1.7000000000000001E-2,10]
["Office",5,"Install daylight harvesting sensors","Hot & Humid",109452,17085,-1304,15782,7,72057,0.54725999999999997,8.5425000000000001E-2,-6.5199999999999998E-3,7.8909999999999994E-2,0.36028500000000002,177969,0.889845,{"$f":"Q11*'Emission Factors'!$L$1/1000","v":3.0361511399999999},82,-3110,-1.5549999999999999,1.5,0.02,20]
["Office",6,"Exterior light fixture upgrade, light level reduction, and controls.","Hot & Humid",87534,5840,0,5840,16,-8221,0.43767,2.92E-2,0,2.92E-2,-4.1105000000000003E-2,100314,0.50156999999999996,{"$f":"Q12*'Emission Factors'!$L$1/1000","v":1.7113568399999999},0,0,0,1.7,2.3E-2,7]
["Office",7,"Implement seasonal temperature setpoints (69°F heating setpoint, 75°F cooling setpoint) (pneumatic zone controls)","Hot & Humid",63390,17075,0,17075,4,153357,0.31695000000000001,8.5375000000000006E-2,0,8.5375000000000006E-2,0.76678500000000005,60669,0.30334499999999998,{"$f":"Q13*'Emission Factors'!$L$1/1000","v":1.03501314},40,8899,4.4494999999999996,5.5,7.2999999999999995E-2,13]
["Office",8,"Reduce ventilation during unoccupied periods (pneumatic zone controls)","Hot & Humid",36684,17654,-2173,15481,2,141767,0.18342,8.8270000000000001E-2,-1.0865E-2,7.7405000000000002E-2,0.70883499999999999,131397,0.65698500000000004,{"$f":"Q14*'Emission Factors'!$L$1/1000","v":2.2416328200000004},2,8029,4.0145,6.3,8.3000000000000004E-2,13]
["Office",9,"Implement seasonal temperature setpoints (69°F heating setpoint, 75°F cooling setpoint) (DDC zone controls)","Hot & Humid",36684,17654,-2173,15481,2,141767,0.18342,8.8270000000000001E-2,-1.0865E-2,7.7405000000000002E-2,0.70883499999999999,131397,0.65698500000000004,{"$f":"Q15*'Emission Factors'!$L$1/1000","v":2.2416328200000004},2,8029,4.0145,6.3,8.3000000000000004E-2,13]
["Office",10,"Reduce ventilation during unoccupied periods (DDC zone controls)","Hot & Humid",226887,30339,4345,34684,7,132594,1.1344350000000001,0.151695,2.1725000000000001E-2,0.17341999999999999,0.66296999999999995,278675,1.393375,{"$f":"Q16*'Emission Factors'!$L$1/1000","v":4.7541954999999998},31,8030,4.0149999999999997,8.8000000000000007,0.11700000000000001,13]
["Office",11,"Replace supply fan motor and variable frequency drive","Hot & Humid",42490,11505,0,11505,4,43717,0.21245,5.7525E-2,0,5.7525E-2,0.218585,120097,0.60048500000000005,{"$f":"Q17*'Emission Factors'!$L$1/1000","v":2.0488548199999999},32,-8,-4.0000000000000001E-3,2,2.7E-2,15]
["Office",12,"Increase efficiency of condenser water system by adding VFDs and lowering supply temperature","Hot & Humid",37153,2551,-217,2334,16,-17287,0.18576500000000001,1.2755000000000001E-2,-1.085E-3,1.167E-2,-8.6434999999999998E-2,39053,0.19526499999999999,{"$f":"Q18*'Emission Factors'!$L$1/1000","v":0.66624418000000007},0,0,0,0.7,8.9999999999999993E-3,15]
["Office",13,"Replace the tenant server room cooling units with more efficient units","Hot & Humid",53822,3520,0,3520,15,-2092,0.26911000000000002,1.7600000000000001E-2,0,1.7600000000000001E-2,-1.0460000000000001E-2,44992,0.22495999999999999,{"$f":"Q19*'Emission Factors'!$L$1/1000","v":0.76756351999999994},6,0,0,0.8,0.01,15]
["Office",1,"RCx (EBCx) Package","Hot & Dry",61100,60600,0,60600,1,495000,0.30549999999999999,0.30299999999999999,0,0.30299999999999999,2.4750000000000001,497000,2.4849999999999999,{"$f":"Q20*'Emission Factors'!$L$1/1000","v":8.4788199999999989},4,26000,13,21,0.22,20]
["Office",2,"Standard Retrofit Package","Hot & Dry",426000,192000,-4900,187000,2,1220000,2.13,0.96,-2.4500000000000001E-2,0.93500000000000005,6.1,1110000,5.55,{"$f":"Q21*'Emission Factors'!$L$1/1000","v":18.936599999999999},170,39000,19.5,39,0.4,20]
["Office",3,"Major Renovation (Deep Retrofit) Package","Hot & Dry",890000,159000,1800,161000,6,422000,4.45,0.79500000000000004,8.9999999999999993E-3,0.80500000000000005,2.11,1780000,8.9,{"$f":"Q22*'Emission Factors'!$L$1/1000","v":30.366800000000001},470,41000,20.5,51,0.52,20]
["Office",4,"Install occupancy sensors for lighting","Hot & Dry",76289,8168,-765,7403,10,-11024,0.38144499999999998,4.0840000000000001E-2,-3.8249999999999998E-3,3.7014999999999999E-2,-5.5120000000000002E-2,104944,0.52471999999999996,{"$f":"Q23*'Emission Factors'!$L$1/1000","v":1.7903446399999998},35,-1432,-0.71599999999999997,1.1000000000000001,1.4E-2,10]
["Office",5,"Install daylight harvesting sensors","Hot & Dry",110436,14119,-1446,12674,9,35503,0.55218,7.0595000000000005E-2,-7.2300000000000003E-3,6.3369999999999996E-2,0.17751500000000001,173328,0.86663999999999997,{"$f":"Q24*'Emission Factors'!$L$1/1000","v":2.9569756800000002},78,-3538,-1.7689999999999999,1.2,1.6E-2,20]
["Office",6,"Exterior light fixture upgrade, light level reduction, and controls.","Hot & Dry",88321,6241,0,6241,15,-4691,0.44160500000000003,3.1205E-2,0,3.1205E-2,-2.3455E-2,97369,0.48684500000000003,{"$f":"Q25*'Emission Factors'!$L$1/1000","v":1.6611151400000002},0,0,0,1.7,2.1999999999999999E-2,7]
["Office",7,"Implement seasonal temperature setpoints (69°F heating setpoint, 75°F cooling setpoint) (pneumatic zone controls)","Hot & Dry",63960,24242,0,24242,3,235125,0.31979999999999997,0.12121,0,0.12121,1.1756249999999999,69294,0.34647,{"$f":"Q26*'Emission Factors'!$L$1/1000","v":1.18215564},133,10333,5.1665000000000001,6.3,8.4000000000000005E-2,13]
["Office",8,"Reduce ventilation during unoccupied periods (pneumatic zone controls)","Hot & Dry",37014,20065,-2550,17514,2,164915,0.18507000000000001,0.100325,-1.2749999999999999E-2,8.7569999999999995E-2,0.82457499999999995,147031,0.735155,{"$f":"Q27*'Emission Factors'!$L$1/1000","v":2.5083488599999999},1,9054,4.5270000000000001,7,9.2999999999999999E-2,13]
["Office",9,"Implement seasonal temperature setpoints (69°F heating setpoint, 75°F cooling setpoint) (DDC zone controls)","Hot & Dry",37014,20065,-2550,17514,2,164915,0.18507000000000001,0.100325,-1.2749999999999999E-2,8.7569999999999995E-2,0.82457499999999995,147031,0.735155,{"$f":"Q28*'Emission Factors'!$L$1/1000","v":2.5083488599999999},1,9054,4.5270000000000001,7,9.2999999999999999E-2,13]
["Office",10,"Reduce ventilation during unoccupied periods (DDC zone controls)","Hot & Dry",228927,33495,5100,38595,6,168757,1.1446350000000001,0.16747500000000001,2.5499999999999998E-2,0.19297500000000001,0.84378500000000001,318300,1.5914999999999999,{"$f":"Q29*'Emission Factors'!$L$1/1000","v":5.430197999999999},13,9016,4.508,9.9,0.13100000000000001,13]
["Office",11,"Replace supply fan motor and variable frequency drive","Hot & Dry",45189,15235,0,15235,3,65114,0.22594500000000001,7.6175000000000007E-2,0,7.6175000000000007E-2,0.32557000000000003,153133,0.76566500000000004,{"$f":"Q30*'Emission Factors'!$L$1/1000","v":2.6124489799999999},72,-15,-7.4999999999999997E-3,2.6,3.4000000000000002E-2,15]
["Office",12,"Increase efficiency of condenser water system by adding VFDs and lowering supply temperature","Hot & Dry",45190,7561,-241,7320,6,30189,0.22595000000000001,3.7804999999999998E-2,-1.2049999999999999E-3,3.6600000000000001E-2,0.150945,82375,0.41187499999999999,{"$f":"Q31*'Emission Factors'!$L$1/1000","v":1.4053174999999998},17,0,0,1.4,1.9E-2,15]
["Office",13,"Replace the tenant server room cooling units with more efficient units","Hot & Dry",54306,4007,0,4007,14,3095,0.27152999999999999,2.0035000000000001E-2,0,2.0035000000000001E-2,1.5474999999999999E-2,50719,0.25359500000000001,{"$f":"Q32*'Emission Factors'!$L$1/1000","v":0.86526614000000002},8,0,0,0.9,1.0999999999999999E-2,15]
["Office",1,"RCx (EBCx) Package","Marine",61100,72000,0,72000,1,613000,0.30549999999999999,0.36,0,0.36,3.0649999999999999,410000,2.0499999999999998,{"$f":"Q33*'Emission Factors'!$L$1/1000","v":6.9945999999999993},0,37000,18.5,26,0.27,20]
["Office",2,"Standard Retrofit Package","Marine",439000,204000,-4800,199000,2,1320000,2.1949999999999998,1.02,-2.4E-2,0.995,6.6,876000,4.38,{"$f":"Q34*'Emission Factors'!$L$1/1000","v":14.944559999999999},150,51000,25.5,40,0.43,20]
["Office",3,"Major Renovation (Deep Retrofit) Package","Marine",918000,159000,2800,162000,6,369000,4.59,0.79500000000000004,1.4E-2,0.81,1.845,1250000,6.25,{"$f":"Q35*'Emission Factors'!$L$1/1000","v":21.324999999999999},240,57000,28.5,60,0.53,20]
["Office",4,"Install occupancy sensors for lighting","Marine",79008,8118,-750,7368,11,-14900,0.39504,4.0590000000000001E-2,-3.7499999999999999E-3,3.6839999999999998E-2,-7.4499999999999997E-2,97686,0.48842999999999998,{"$f":"Q36*'Emission Factors'!$L$1/1000","v":1.6665231599999999},29,-1652,-0.82599999999999996,0.8,1.2E-2,10]
["Office",5,"Install daylight harvesting sensors","Marine",114372,10567,-1500,9067,13,-9755,0.57186000000000003,5.2835E-2,-7.4999999999999997E-3,4.5335E-2,-4.8774999999999999E-2,141075,0.70537499999999997,{"$f":"Q37*'Emission Factors'!$L$1/1000","v":2.4067395},68,-4335,-2.1675,0.2,3.0000000000000001E-3,20]
["Office",6,"Exterior light fixture upgrade, light level reduction, and controls.","Marine",91469,7023,0,7023,14,1281,0.457345,3.5115E-2,0,3.5115E-2,6.4050000000000001E-3,97572,0.48786000000000002,{"$f":"Q38*'Emission Factors'!$L$1/1000","v":1.6645783200000002},0,0,0,1.7,2.4E-2,7]
["Office",7,"Implement seasonal temperature setpoints (69°F heating setpoint, 75°F cooling setpoint) (pneumatic zone controls)","Marine",66240,14970,0,14970,4,127307,0.33119999999999999,7.485E-2,0,7.485E-2,{"$f":"J39/$D$2","v":0.63653499999999996},19314,{"$f":"P39/$D$2","v":9.6570000000000003E-2},{"$f":"Q39*'Emission Factors'!$L$1/1000","v":0.32949684000000001},24,11063,{"$f":"IF(T39<>0,T39*100/$D$2,0)","v":5.5315000000000003},5.9,8.5999999999999993E-2,13]
["Office",8,"Reduce ventilation during unoccupied periods (pneumatic zone controls)","Marine",38333,18480,-2500,15980,2,145985,0.191665,9.2399999999999996E-2,-1.2500000000000001E-2,7.9899999999999999E-2,0.72992500000000005,105708,0.52854000000000001,{"$f":"Q40*'Emission Factors'!$L$1/1000","v":1.8033784800000001},-42,8549,4.2744999999999997,6.1,8.8999999999999996E-2,13]
["Office",9,"Implement seasonal temperature setpoints (69°F heating setpoint, 75°F cooling setpoint) (DDC zone controls)","Marine",38333,18480,-2500,15980,2,145985,0.191665,9.2399999999999996E-2,-1.2500000000000001E-2,7.9899999999999999E-2,0.72992500000000005,105708,0.52854000000000001,{"$f":"Q41*'Emission Factors'!$L$1/1000","v":1.8033784800000001},-42,8549,4.2744999999999997,6.1,8.8999999999999996E-2,13]
["Office",10,"Reduce ventilation during unoccupied periods (DDC zone controls)","Marine",237086,29838,5000,34838,7,118403,{"$f":"E42/$D$2","v":1.18543},{"$f":"F42/$D$2","v":0.14918999999999999},{"$f":"IF(G42<>0,G42/$D$2,0)","v":2.5000000000000001E-2},{"$f":"H42/$D$2","v":0.17419000000000001},0.59201499999999996,228714,1.14357,{"$f":"Q42*'Emission Factors'!$L$1/1000","v":3.9018608399999999},-26,8477,4.2385000000000002,8.1,0.11899999999999999,13]
["Office",11,"Replace supply fan motor and variable frequency drive","Marine",37368,11243,0,11243,3,45430,0.18684000000000001,5.6215000000000001E-2,0,5.6215000000000001E-2,0.22714999999999999,116283,0.58141500000000002,{"$f":"Q43*'Emission Factors'!$L$1/1000","v":1.98378798},34,-9,-4.4999999999999997E-3,2,2.9000000000000001E-2,15]
["Office",12,"Increase efficiency of condenser water system by adding VFDs and lowering supply temperature","Marine",42298,2682,-250,2432,18,-22393,0.21149000000000001,1.341E-2,-1.25E-3,1.2160000000000001E-2,-0.111965,21503,0.107515,{"$f":"Q44*'Emission Factors'!$L$1/1000","v":0.36684117999999999},12,0,0,0.4,5.0000000000000001E-3,15]
["Office",13,"Replace the tenant server room cooling units with more efficient units","Marine",56242,3937,0,3937,14,768,0.28121000000000002,1.9685000000000001E-2,0,1.9685000000000001E-2,3.8400000000000001E-3,46108,0.23053999999999999,{"$f":"Q45*'Emission Factors'!$L$1/1000","v":0.78660247999999999},7,0,0,0.8,1.2E-2,15]
["Office",1,"RCx (EBCx) Package","Cold",61100,63200,0,63200,1,522000,0.30549999999999999,0.316,0,0.316,2.61,341000,1.7050000000000001,{"$f":"Q46*'Emission Factors'!$L$1/1000","v":5.8174599999999996},-20,30000,15,20,0.24,20]
["Office",2,"Standard Retrofit Package","Cold",439000,192000,-5300,187000,2,1200000,2.1949999999999998,0.96,-2.6499999999999999E-2,0.93500000000000005,6,806000,4.03,{"$f":"Q47*'Emission Factors'!$L$1/1000","v":13.750360000000001},310,39000,19.5,33,0.39,20]
["Office",3,"Major Renovation (Deep Retrofit) Package","Cold",885000,151000,1900,153000,6,302000,4.4249999999999998,0.755,9.4999999999999998E-3,0.76500000000000001,1.51,1170000,5.85,{"$f":"Q48*'Emission Factors'!$L$1/1000","v":19.960199999999997},410,44000,22,42,0.49,20]
["Office",4,"Install occupancy sensors for lighting","Cold",74778,11089,-832,10257,7,20236,0.37389,5.5445000000000001E-2,-4.1599999999999996E-3,5.1284999999999997E-2,0.10118000000000001,99419,0.49709500000000001,{"$f":"Q49*'Emission Factors'!$L$1/1000","v":1.6960881400000001},31,-1632,-0.81599999999999995,0.9,1.2999999999999999E-2,10]
["Office",5,"Install daylight harvesting sensors","Cold",108249,14659,-1663,12996,8,41478,0.54124499999999998,7.3294999999999999E-2,-8.3149999999999995E-3,6.4979999999999996E-2,0.20738999999999999,156231,0.78115500000000004,{"$f":"Q50*'Emission Factors'!$L$1/1000","v":2.6653008600000003},69,-4384,-2.1920000000000002,0.5,7.0000000000000001E-3,20]
["Office",6,"Exterior light fixture upgrade, light level reduction, and controls.","Cold",86572,9075,0,9075,10,28823,0.43286000000000002,4.5374999999999999E-2,0,4.5374999999999999E-2,0.14411499999999999,97442,0.48720999999999998,{"$f":"Q51*'Emission Factors'!$L$1/1000","v":1.66236052},0,0,0,1.7,2.5000000000000001E-2,7]
["Office",7,"Implement seasonal temperature setpoints (69°F heating setpoint, 75°F cooling setpoint) (pneumatic zone controls)","Cold",62694,15324,0,15324,4,133702,0.31347000000000003,7.6619999999999994E-2,0,7.6619999999999994E-2,0.66851000000000005,23206,0.11602999999999999,{"$f":"Q52*'Emission Factors'!$L$1/1000","v":0.39589436},182,8971,4.4855,4.9000000000000004,7.3999999999999996E-2,13]
["Office",8,"Reduce ventilation during unoccupied periods (pneumatic zone controls)","Cold",36281,15387,-2772,12615,3,109575,0.18140500000000001,7.6935000000000003E-2,-1.3860000000000001E-2,6.3075000000000006E-2,0.547875,83989,0.41994500000000001,{"$f":"Q53*'Emission Factors'!$L$1/1000","v":1.4328523400000002},0,6457,3.2284999999999999,4.7,7.0999999999999994E-2,13]
["Office",9,"Implement seasonal temperature setpoints (69°F heating setpoint, 75°F cooling setpoint) (DDC zone controls)","Cold",36281,15387,-2772,12615,3,109575,0.18140500000000001,7.6935000000000003E-2,-1.3860000000000001E-2,6.3075000000000006E-2,0.547875,83989,0.41994500000000001,{"$f":"Q54*'Emission Factors'!$L$1/1000","v":1.4328523400000002},0,6457,3.2284999999999999,4.7,7.0999999999999994E-2,13]
["Office",10,"Reduce ventilation during unoccupied periods (DDC zone controls)","Cold",224393,29251,5545,34796,7,125832,1.1219650000000001,0.146255,2.7725E-2,0.17398,0.62916000000000005,205519,1.027595,{"$f":"Q55*'Emission Factors'!$L$1/1000","v":3.50615414},1,6133,3.0665,6.6,0.1,13]
["Office",11,"Replace supply fan motor and variable frequency drive","Cold",30665,11796,0,11796,3,53234,0.15332499999999999,5.8979999999999998E-2,0,5.8979999999999998E-2,0.26617000000000002,99542,0.49770999999999999,{"$f":"Q56*'Emission Factors'!$L$1/1000","v":1.6981865199999999},69,-35,-1.7500000000000002E-2,1.7,2.5999999999999999E-2,15]
["Office",12,"Increase efficiency of condenser water system by adding VFDs and lowering supply temperature","Cold",46189,2950,-277,2673,17,-24357,0.23094500000000001,1.4749999999999999E-2,-1.3849999999999999E-3,1.3365E-2,-0.121785,23092,0.11545999999999999,{"$f":"Q57*'Emission Factors'!$L$1/1000","v":0.39394951999999994},15,0,0,0.4,5.0000000000000001E-3,15]
["Office",13,"Replace the tenant server room cooling units with more efficient units","Cold",51091,5100,0,5100,10,18124,0.25545499999999999,2.5499999999999998E-2,0,2.5499999999999998E-2,9.0620000000000006E-2,48903,0.24451500000000001,{"$f":"Q58*'Emission Factors'!$L$1/1000","v":0.83428518000000007},7,0,0,0.8,1.2999999999999999E-2,15]
["Office",1,"RCx (EBCx) Package","Very Cold",61100,57100,0,57100,1,459000,0.30549999999999999,0.28549999999999998,0,0.28549999999999998,2.2949999999999999,338000,1.69,{"$f":"Q59*'Emission Factors'!$L$1/1000","v":5.7662800000000001},-60,34000,17,23,0.25,20]
["Office",2,"Standard Retrofit Package","Very Cold",417000,169000,-4800,164000,3,1020000,2.085,0.84499999999999997,-2.4E-2,0.82,5.0999999999999996,788000,3.94,{"$f":"Q60*'Emission Factors'!$L$1/1000","v":13.443280000000001},250,41000,20.5,34,0.38,20]
["Office",3,"Major Renovation (Deep Retrofit) Package","Very Cold",837000,135000,2500,137000,6,211000,4.1849999999999996,0.67500000000000004,1.2500000000000001E-2,0.68500000000000005,1.0549999999999999,1150000,5.75,{"$f":"Q61*'Emission Factors'!$L$1/1000","v":19.619},340,49000,24.5,44,0.49,20]
[]
["Office",4,"Install occupancy sensors for lighting","Very Cold",74476,9907,-757,9150,8,9865,{"$f":"E63/$D$2","v":0.37237999999999999},{"$f":"F63/$D$2","v":4.9535000000000003E-2},{"$f":"IF(G63<>0,G63/$D$2,0)","v":-3.7850000000000002E-3},{"$f":"H63/$D$2","v":4.5749999999999999E-2},4.9325000000000001E-2,96844,0.48421999999999998,{"$f":"Q63*'Emission Factors'!$L$1/1000","v":1.6521586399999999},43,-1901,-0.95050000000000001,0.7,0.01,10]
["Office",5,"Install daylight harvesting sensors","Very Cold",107811,13599,-1514,12085,9,31404,0.53905499999999995,6.7995E-2,-7.5700000000000003E-3,6.0425E-2,0.15701999999999999,149806,0.74902999999999997,{"$f":"Q64*'Emission Factors'!$L$1/1000","v":2.5556903600000003},121,-4761,-2.3805000000000001,0.2,3.0000000000000001E-3,20]
["Office",6,"Exterior light fixture upgrade, light level reduction, and controls.","Very Cold",86222,8685,0,8685,10,25048,0.43110999999999999,4.3424999999999998E-2,0,4.3424999999999998E-2,0.12523999999999999,97644,0.48821999999999999,{"$f":"Q65*'Emission Factors'!$L$1/1000","v":1.66580664},0,0,0,1.7,2.5000000000000001E-2,7]
["Office",7,"Implement seasonal temperature setpoints (69°F heating setpoint, 75°F cooling setpoint) (pneumatic zone controls)","Very Cold",62440,10934,0,10934,6,83563,0.31219999999999998,5.4670000000000003E-2,0,5.4670000000000003E-2,0.41781499999999999,18553,9.2765E-2,{"$f":"Q66*'Emission Factors'!$L$1/1000","v":0.31651418000000003},173,8324,4.1619999999999999,4.5,6.6000000000000003E-2,13]
["Office",8,"Reduce ventilation during unoccupied periods (pneumatic zone controls)","Very Cold",36134,12263,-2524,9739,4,76643,0.18067,6.1315000000000001E-2,-1.2619999999999999E-2,4.8695000000000002E-2,0.38321499999999997,85911,0.42955500000000002,{"$f":"Q67*'Emission Factors'!$L$1/1000","v":1.46564166},0,5274,2.637,4.0999999999999996,0.06,13]
["Office",9,"Implement seasonal temperature setpoints (69°F heating setpoint, 75°F cooling setpoint) (DDC zone controls)","Very Cold",36134,12263,-2524,9739,4,76643,0.18067,6.1315000000000001E-2,-1.2619999999999999E-2,4.8695000000000002E-2,0.38321499999999997,85911,0.42955500000000002,{"$f":"Q68*'Emission Factors'!$L$1/1000","v":1.46564166},0,5274,2.637,4.0999999999999996,0.06,13]
["Office",10,"Reduce ventilation during unoccupied periods (DDC zone controls)","Very Cold",223487,24948,5048,29995,8,76066,1.117435,0.12474,2.5239999999999999E-2,0.149975,0.38033,209094,1.0454699999999999,{"$f":"Q69*'Emission Factors'!$L$1/1000","v":3.5671436399999998},22,4366,2.1829999999999998,5.8,8.5000000000000006E-2,13]
["Office",11,"Replace supply fan motor and variable frequency drive","Very Cold",30541,11979,0,11979,3,54451,0.15270500000000001,5.9894999999999997E-2,0,5.9894999999999997E-2,0.27225500000000002,108072,0.54035999999999995,{"$f":"Q70*'Emission Factors'!$L$1/1000","v":1.8437083199999997},88,-85,-4.2500000000000003E-2,1.8,2.7E-2,15]
["Office",12,"Increase efficiency of condenser water system by adding VFDs and lowering supply temperature","Very Cold",42414,1638,-252,1385,">20",-34541,0.21207000000000001,8.1899999999999994E-3,-1.2600000000000001E-3,6.9249999999999997E-3,-0.172705,13158,6.5790000000000001E-2,{"$f":"Q71*'Emission Factors'!$L$1/1000","v":0.22447548000000001},9,0,0,0.2,3.0000000000000001E-3,15]
["Office",13,"Replace the tenant server room cooling units with more efficient units","Very Cold",50884,4737,0,4737,11,14147,0.25441999999999998,2.3685000000000001E-2,0,2.3685000000000001E-2,{"$f":"J72/$D$2","v":7.0735000000000006E-2},48308,0.24154,{"$f":"Q72*'Emission Factors'!$L$1/1000","v":0.82413448},8,0,{"$f":"T72*100/$D$2","v":0},0.8,1.2E-2,15]
["Office",14,"Install IR heating","Hot & Dry",100000,20000,0,30000,10,5000,{"$f":"E73/$D$3","v":0.5},{"$f":"F73/$D$3","v":0.1},{"$f":"IF(G73<>0,G73/$D$3,0)","v":0},{"$f":"H73/$D$3","v":0.15},{"$f":"J73/$D$3","v":2.5000000000000001E-2},5000,{"$f":"P73/$D$3","v":2.5000000000000001E-2},{"$f":"Q73*'Emission Factors'!$L$1/1000","v":8.5300000000000015E-2},10,25000,{"$f":"T73*100/$D$3","v":12.5},0.5,0.01,10]
[null,null,"<Insert user-defined measures>",null,null,null,null,null,null,null,{"$f":"E74/$D$3","v":0},{"$f":"F74/$D$3","v":0},{"$f":"IF(G74<>0,G74/$D$3,0)","v":0},{"$f":"H74/$D$3","v":0},{"$f":"J74/$D$3","v":0},null,{"$f":"P74/$D$3","v":0},{"$f":"Q74*'Emission Factors'!$L$1/1000","v":0},null,null,{"$f":"T74*100/$D$3","v":0}]
[null,null,"<Insert user-defined measures>",null,null,null,null,null,null,null,0,0,0,0,0,null,0,{"$f":"Q75*'Emission Factors'!$L$1/1000","v":0},null,null,0]
[null,null,"<Insert user-defined measures>",null,null,null,null,null,null,null,0,0,0,0,0,null,0,{"$f":"Q76*'Emission Factors'!$L$1/1000","v":0},null,null,0]
[null,null,"<Insert user-defined measures>",null,null,null,null,null,null,null,0,0,0,0,0,null,0,{"$f":"Q77*'Emission Factors'!$L$1/1000","v":0},null,null,0]

{"sheet":"References","index":5,"n_rows":38,"n_cols":1,"rows_kept":38,"cut":false,"hidden":false,"merged":[]}
["References and Resources"]
["The following resources provided reference data for the analysis contained in this estimator worksheet.  Additional GHG reduction resources are available through the Federal Energy Management Program (FEMP) at "]
[]
["DOE - Department of Energy. 2011. Advanced Energy Retrofit Guides Office Buildings. PNNL-20761, Richland, WA.  Available at http://www.pnnl.gov/main/publications/external/technical_reports/PNNL-20761.pdf "]
["EPA - Environmental Protection Agency. 2012. Emissions & Generation Resource Integrated Database (eGRID) 2012 Version 1.0. Available at http://www.epa.gov/cleanenergy/documents/egridzips/eGRID2012V1_0_year09_DATA.xls"]
["EIA - Energy Information Administration. 2003.  Commercial Building Energy Consumption Survey 2003.  Available at http://www.eia.gov/emeu/cbecs/cbecs2003/detailed_tables_2003/detailed_tables_2003.html#consumexpen03"]
[]
[]
["eGRID Region Map"]
["Source: U.S. EPA http://www.epa.gov/cleanenergy/documents/egridzips/eGRID2012_eGRID_subregions.jpg "]
[]
[]
[]
[]
[]
[]
[]
[]
[]
[]
[]
[]
[]
[]
[]
[]
[]
[]
[]
[]
[]
[]
[]
[]
[]
[]
["CBECS Climate Zone Map"]
["Source: U.S. Energy Information Administration (EIA), http://www.eia.gov/emeu/cbecs/climate_zones.html "]

{"sheet":"Pivot Tables","index":6,"n_rows":75,"n_cols":5,"rows_kept":75,"cut":false,"hidden":false,"merged":[]}
["DO NOT EDIT - This is linked to the 'Summary' worksheet"]
["Row Labels","Sum of Annual GHG Reduction (MTCO2e/year)","Sum of Capital Cost ($)","Sum of Annual Cost Savings ($/year)","Sum of Cumulative GHG Reduction (MTCO2e)"]
["Program B",4183.7092057328009,5766675.4000000004,2160640,83378.417959151586]
["(blank)",0,0,0,0]
["Grand Total",4183.7092057328009,5766675.4000000004,2160640,83378.417959151586]
[]
[]
[]
[]
[]
[]
[]
[]
[]
[]
[]
[]
[]
[]
[]
[]
[]
[]
[]
["Row Labels","Sum of Annual GHG Reduction (MTCO2e/year)","Sum of Capital Cost ($)","Sum of Annual Cost Savings ($/year)","Sum of Cumulative GHG Reduction (MTCO2e)"]
["Site 2",2073.1872745177852,1420175,939750,41198.148805316108]
["Site 3",804.07436515574091,2164100.4,602140,16051.317832649956]
["Site 4",1306.4475660592755,2182400,618750,26128.951321185508]
["(blank)",0,0,0,0]
["Grand Total",4183.7092057328018,5766675.4000000004,2160640,83378.417959151571]
[]
[]
[]
[]
[]
[]
[]
[]
[]
[]
[]
[]
[]
[]
[]
[]
[]
[]
[]
[]
[]
[]
[]
[]
[]
[]
[]
[]
[]
[]
[]
[]
[]
[]
[]
[]
[]
["Row Labels","Sum of Annual GHG Reduction (MTCO2e/year)","Sum of Capital Cost ($)","Sum of Annual Cost Savings ($/year)","Sum of Cumulative GHG Reduction (MTCO2e)"]
["Install IR heating",26.559668503959866,20000,6000,265.59668503959864]
["Major Renovation (Deep Retrofit) Package",690.45464381997795,2123550,361350,13809.09287639956]
["RCx (EBCx) Package",1964.5549836112345,748475,685650,39291.099672224693]
["Standard Retrofit Package",1496.1060157046568,2649850,1085200,29922.120314093132]
["(blank)",0,0,0,0]
["Replace the tenant server room cooling units with more efficient units",6.0338940929727585,224800.40000000002,22440,90.508411394591377]
["Grand Total",4183.7092057328009,5766675.4000000004,2160640,83378.417959151571]

{"sheet":"Emission Factors","index":7,"n_rows":36,"n_cols":13,"rows_kept":36,"cut":false,"hidden":false,"merged":[[1,5,1,9]]}
["eGRID 2012 Emission Factors (2009 Year Data)",null,null,null,null,null,null,null,null,null,"Conversion:",3412,"kBtu/MWh"]
[null,null,null,null,null,"Baseload Emission Factors"]
["eGRID Subregion","eGRID Subregion Acronym","CO2 (lb/MWh)","CH4\n (lb/GWh)","N20 (lb/GWh)","CO2 (kg/MWh)","CH4 (kg/MWh)","N20 (kg/MWh)","CO2e (kg/MWh)","CO2e (kg/kBtu)"]
["ASCC Alaska Grid","AKGD",1280.8599999999999,27.736999999999998,7.6877000000000004,{"$f":"C4/2.20462","v":580.9890139797335},{"$f":"D4/2.20462/1000","v":1.2581306529016338E-2},{"$f":"E4/2.20462/1000","v":3.4870862098683678E-3},{"$f":"F4+(G4*21)+(H4*310)","v":582.33421814190206},{"$f":"I4/$L$1","v":0.17067239687629016}]
["ASCC Miscellaneous","AKMS",521.26,21.7818,4.2813999999999997,{"$f":"C5/2.20462","v":236.43983997242157},{"$f":"D5/2.20462/1000","v":9.8800700347452183E-3},{"$f":"E5/2.20462/1000","v":1.942012682457748E-3},237.2493453747131,6.9533805795636894E-2]
["WECC Southwest","AZNM",1191.3499999999999,19.131699999999999,15.581799999999999,540.38791265614941,8.6780034654498281E-3,7.0677939962442505E-3,542.76116686775958,0.15907419896475955]
["WECC California","CAMX",658.68,28.9404,6.1653000000000002,298.77257758706719,1.312716023623119E-2,2.7965363645435495E-3,299.91517422503654,8.790010967908457E-2]
["ERCOT All","ERCT",1181.73,16.702999999999999,13.1035,536.02434886737854,7.5763623663034898E-3,5.9436546887899058E-3,538.02598543059571,0.1576863966678182]
["FRCC All","FRCC",1176.6099999999999,39.238,13.5329,533.701953171068,1.7798078580435632E-2,6.1384274841015688E-3,535.97862534132867,0.15708634974833782]
["HICC Miscellaneous","HIMS",1351.66,72.398600000000002,13.8041,613.10339196777682,3.2839491613067109E-2,6.2614418811405151E-3,615.73406827480483,0.18046133302309636]
["HICC Oahu","HIOA",1593.35,101.7449,21.980499999999999,722.73226224927657,4.6150765211238225E-2,9.9701989458500784E-3,726.79218999192608,0.21301060667993144]
["MRO East","MORE",1591.65,23.980899999999998,27.0413,721.96115430323607,1.0877566201885132E-2,1.2265741941921964E-2,725.9919631954715,0.21277607362118156]
["MRO West","MROW",1628.6,28.798300000000001,27.790199999999999,738.72141230688283,1.3062704683800386E-2,1.2605437671798315E-2,742.90341478350012,0.21773253657195196]
["NPCC New England","NEWE",728.41,75.684200000000004,13.855,330.40161116201432,3.4329816476308853E-2,6.2845297602307885E-3,333.07074153368836,9.7617450625348295E-2]
["WECC Northwest","NWPP",819.21,15.293100000000001,12.500400000000001,371.58784733877047,6.936841723290183E-3,5.6700928051092708E-3,373.49124978454347,0.10946402396967862]
["NPCC NYC/Westchester","NYCW",610.66999999999996,23.750900000000001,2.8065000000000002,276.99558200506209,1.0773239832714937E-2,1.2730085003311231E-3,277.61645267665176,8.1364728217072621E-2]
["NPCC Long Island","NYLI",1347.99,96.864599999999996,12.3733,611.43870599014804,4.3937095735319467E-2,5.6124411463200014E-3,614.10124175594899,0.17998277894371306]
["NPCC Upstate NY","NYUP",497.92,15.9389,6.7655000000000003,225.85298146619374,7.2297720242037187E-3,3.0687828287868208E-3,226.95612935562593,6.6517036739632454E-2]
["RFC East","RFCE",947.42,26.838100000000001,14.962400000000001,429.74299425751377,1.2173571862724643E-2,6.7868385481398164E-3,432.10255921655437,0.12664201618304641]
["RFC Michigan","RFCM",1659.46,31.408999999999999,27.888400000000001,752.71928949206676,1.4246899692464008E-2,1.2649980495504896E-2,756.93996833921506,0.22184641510527991]
["RFC West","RFCW",1520.59,18.119,25.133400000000002,689.72884215873944,8.2186499260643569E-3,1.1400332030009709E-2,693.43553673648978,0.20323433081374262]
["WECC Rockies","RMPA",1824.51,22.248999999999999,27.190300000000001,827.58479919441902,1.0091988642033549E-2,1.2333327285427876E-2,831.62006241438428,0.24373389871464957]
["SPP North","SPNO",1815.76,21.008600000000001,28.890999999999998,823.6158612368572,9.5293519971695814E-3,1.3104752746505067E-2,827.87845098021432,0.24263729512901944]
["SPP South","SPSO",1599.02,23.248000000000001,21.787500000000001,725.30413404577666,1.0545127958559754E-2,9.8826555143290019E-3,728.58920494234837,0.21353728163609273]
["SERC Mississippi Valley","SRMV",1002.41,19.447600000000001,10.654400000000001,454.6860683473796,8.821293465540548E-3,4.8327602942910804E-3,456.3694712013862,0.13375424126652585]
["SERC Midwest","SRMW",1749.75,19.570900000000002,28.982500000000002,793.67419328501069,8.8772214712739619E-3,1.3146256497718429E-2,797.93595445020014,0.23386165136289572]
["SERC South","SRSO",1325.68,22.271699999999999,20.775500000000001,601.3190481806389,1.0102285201077739E-2,9.423619489980134E-3,604.45251821175543,0.17715489982759539]
["SERC Tennessee Valley","SRTV",1357.71,17.277000000000001,22.086400000000001,615.84762906986248,7.8367246963195487E-3,1.0018234434959314E-2,619.11785296332255,0.18145306358831259]
["SERC Virginia/Carolina","SRVC",1035.8699999999999,21.511600000000001,17.4468,469.86328709709608,9.7575092306157081E-3,7.9137447723417187E-3,472.52145567036496,0.13848811713668374]
["U.S. Territories","USTERR",null,{"$f":"C30/2.20462","v":0},null,0,0,0,0,0]
["U.S. National Average","U.S.",1216.18,24.03,18.079999999999998,551.65062459743638,1.0899837613738424E-2,8.2009598025963651E-3,554.4218187261298,0.16249174054106968]
[]
["Natural Gas Emission Factors"]
["Source: EPA Mandatory Reporting Rule (MRR)"]
[null,"Default HHV (MMBtu/scf)",null,null,null,"CO2 (kg/MMBtu)","CH4 (kg/MMBtu)","N20 (kg/MMBtu)","CO2e (kg/MMBtu)","CO2e (kg/kBtu)"]
["Natural Gas",1.0280000000000001E-3,null,null,null,53.02,1E-3,1E-4,{"$f":"F36+(G36*21)+(H36*310)","v":53.072000000000003},{"$f":"I36/1000","v":5.3072000000000001E-2}]

{"sheet":"Drop down menus","index":8,"n_rows":17,"n_cols":1,"rows_kept":17,"cut":false,"hidden":false,"merged":[]}
["Drop Down Menu Values"]
[]
["Zone"]
["Hot & Humid"]
["Hot & Dry"]
["Marine"]
["Cold"]
["Very Cold"]
[]
["Measure"]
["Default"]
["User-defined Measure"]
[]
["Ease of Implementation"]
["Low"]
["Medium"]
["High"]