{"text_format":"1","workbook":"xlsx","n_sheets":9,"sheets":["Instructions","Input","Summary","Graphs","Measures","References","Pivot Tables","Emission Factors","Drop down menus"],"not_rendered":{"charts":12,"images":2,"macros":1,"external_links":0,"defined_names":1,"comments":0,"pivot_tables":3},"unopened":[],"bounds":{"document_bytes":16777216,"sheet_cells":100000,"rows_first":2000,"rows_last":500,"rows_between":2000,"halvings":0,"cell_chars":16384,"cell_head_chars":4096},"cells_cut":0,"cells_raw":0,"read":"whole","date_system":"1900"}

{"sheet":"Instructions","index":0,"n_rows":25,"n_cols":2,"rows_kept":25,"cut":false,"hidden":false,"merged":[]}
[]
[null,"Buildings GHG Mitigation Estimator Worksheet, Version 1"]
[null,"Version updated January 31, 2013"]
[null,"This tool assists Federal agencies in estimating the greenhouse gas mitigation reduction from implementing  energy efficiency measures across a portfolio of buildings.  The tool is designed to be applied to groups of office buildings, for example at a program, regional, or site level, and can be summarized at the agency level.  While the default savings and cost estimates apply to office buildings, users can define their own efficiency measures, costs, and savings estimates for inclusion in the portfolio assessment.  More information on user-defined measures can be found in Step 2 of the Buildings Emission Reduction guidance.  The output of this tool is a prioritized set of activities that can help the agency to achieve its greenhouse gas reduction targets most cost-effectively.  "]
[]
[null,"The default savings estimates in this tool are taken from the U.S. Department of Energy (DOE)'s Advanced Energy Retrofit Guides, and assume the buildings analyzed use electricity and natural gas.  Savings estimates for buildings that use other fuel types may differ slightly from the values presented in this tool.  Before pursuing actual projects within a building, building audits should be performed to develop a more comprehensive understanding of the systems in place and the energy savings potential."]
[]
[null,"Before starting, the agency should  identify priority groups of buildings and building types to analyze further.  Those data serve as the primary inputs to this tool.  The process of data collection and analysis is described in Step 2 of the Buildings Emission Reduction guidance on the FEMP greenhouse gas mitigation website.  "]
[]
[null,"Follow the instructions in the Input and Summary worksheets to develop mitigation estimates. "]
[null,"Key"]
[null,"Only orange cells require user inputs. "]
[null,"Grey cells are automatic calculations."]
[null,"Blue cells are reference-based assumptions.  "]
[]
{"$rows_left_out":11}
{"sheet":"Input","index":1,"n_rows":73,"n_cols":30,"rows_kept":73,"cut":false,"hidden":false,"merged":[[2,2,2,3],[3,2,3,3],[4,2,4,3]]}
[null,"Buildings Portfolio GHG Mitigation Estimator - (Worksheet with Example Data)"]
[]
[null,"Key: ","User Entered",null,null,"Agency:",null,"ABC"]
[null,null,"Calculated",null,null,"Baseline (2008) Buildings Emissions:",null,40305755]
[null,null,"Reference-based value"]
[]
[]
[]
[null,null,null,null,null,null,null,null,null,null,null,null,null,null,null,null,"Total Annual Energy Savings (kBtu)","Total Annual Electricity GHG Reduction (MTCO2e)","Total Annual Natural Gas GHG Reduction (MTCO2e)","Total Annual GHG Reduction (MTCO2e)",null,null,"Total Cumulative GHG Reduction (MTCO2e)",null,"Total Capital Cost ($)",null,"Total Annual Cost Savings \n($/year)","Average Simple Payback \n(years)"]
[null,"Required Inputs",null,null,null,null,null,null,null,null,null,null,"Calculations used in Estimator - No Input Needed",null,null,null,{"$f":"SUM(Q13:Q68)","v":115367217.3584},{"$f":"SUM(R13:R68)","v":553.05368573280191},{"$f":"SUM(S13:S68)","v":3630.6555200000007},{"$f":"SUM(T13:T68)","v":4183.7092057328009},null,null,{"$f":"SUM(W13:W68)","v":83378.417959151586},null,{"$f":"SUM(Y13:Y68)","v":5766675.4000000004},null,{"$f":"SUM(AA13:AA68)","v":2160640},{"$f":"Y10/AA10","v":2.6689663247926543}]
[]
[null,"Program Name","Site Name","Climate Type1\n(drop down menu)","Total Building Floor Area (SF)","eGRID Region2\n(drop down menu)","Default Measure or \nUser-defined Measure?\n(drop down menu)","Measure Name3\n(drop down menu)","Applicable SF (%)","Ease of Implementation","Proceed to Step 5 - Summary\n(click here)","blank","eGRID Emission Factor (kg CO2e/kBtu)","Electricity Savings (kBtu/sf)","Natural Gas Savings (kBtu/sf)","Energy Savings (kBtu/sf)","Annual Energy Savings (kBtu/yr)","Electricity Annual GHG Reduction (MTCO2e)","Natural Gas Annual GHG Reduction (MTCO2e)","Annual GHG Reduction (MTCO2e/year)","Annual GHG Reduction (MTCO2e/KSF)","Effective Useful Life (years)","Cumulative GHG Reduction (MTCO2e)","Capital Cost Index ($/sf)","Capital Cost ($)","Annual Cost Savings ($/sf)","Annual Cost Savings ($/year)","Simple Payback (years)","Cost Effectiveness ($/MTCO2e)","Rank (based on $/MTCO2e)"]
[null,"Program B","Site 3","Cold",2200000,"RFC West","Default","Replace the tenant server room cooling units with more efficient units",0.4,"High",null,null,{"$f":"IF(F13<>0,VLOOKUP(F13,'Emission Factors'!$A$4:$J$31,7,FALSE),\" \")","v":8.2186499260643569E-3},{"$f":"IF($G13=\"User-defined Measure\",VLOOKUP($H13,Measures!$C$73:$W$77,16,FALSE),IF($D13=\"Hot & Humid\",VLOOKUP($H13,Measures!$C$6:$W$19,16,FALSE),IF($D13=\"Hot & Dry\",VLOOKUP($H13,Measures!$C$20:$W$32,16,FALSE),IF($D13=\"Marine\",VLOOKUP($H13,Measures!$C$33:$W$45,16,FALSE),IF($D13=\"Cold\",VLOOKUP($H13,Measures!$C$46:$W$58,16,FALSE),IF($D13=\"Very Cold\",VLOOKUP($H13,Measures!$C$59:$W$72,16,FALSE),\" \"))))))","v":0.83428518000000007},{"$f":"IF($G13=\"User-defined Measure\",VLOOKUP($H13,Measures!$C$73:$W$77,19,FALSE),IF($D13=\"Hot & Humid\",VLOOKUP($H13,Measures!$C$6:$W$19,19,FALSE),IF($D13=\"Hot & Dry\",VLOOKUP($H13,Measures!$C$20:$W$32,19,FALSE),IF($D13=\"Marine\",VLOOKUP($H13,Measures!$C$33:$W$45,19,FALSE),IF($D13=\"Cold\",VLOOKUP($H13,Measures!$C$46:$W$58,19,FALSE),IF($D13=\"Very Cold\",VLOOKUP($H13,Measures!$C$59:$W$72,19,FALSE),\" \"))))))","v":0},{"$f":"IF(B13=0,\" \",SUM(N13,O13))","v":0.83428518000000007},{"$f":"IF(B13=0,\" \",SUM(N13,O13)*E13*I13)","v":734170.95840000012},{"$f":"IF(B13=0,\" \",PRODUCT(M13,N13,E13,I13)/1000)","v":6.0338940929727585},{"$f":"IF(B13=0,\" \",PRODUCT(O13,'Emission Factors'!$J$36,E13,I13)/1000)","v":0},{"$f":"IF(B13=0,\" \",R13+S13)","v":6.0338940929727585},{"$f":"IF(E13=0,\"\",PRODUCT(1000,(T13/PRODUCT(E13,I13))))","v":6.8566978329235887E-3},{"$f":"IF($G13=\"User-defined Measure\",VLOOKUP($H13,Measures!$C$73:$X$77,22,FALSE),IF($D13=\"Hot & Humid\",VLOOKUP($H13,Measures!$C$6:$X$19,22,FALSE),IF($D13=\"Hot & Dry\",VLOOKUP($H13,Measures!$C$20:$X$32,22,FALSE),IF($D13=\"Marine\",VLOOKUP($H13,Measures!$C$33:$X$45,22,FALSE),IF($D13=\"Cold\",VLOOKUP($H13,Measures!$C$46:$X$58,22,FALSE),IF($D13=\"Very Cold\",VLOOKUP($H13,Measures!$C$59:$X$72,22,FALSE),\" \"))))))","v":15},{"$f":"IF(E13=0,\" \",V13*T13)","v":90.508411394591377},{"$f":"IF($G13=\"User-defined Measure\",VLOOKUP($H13,Measures!$C$73:$W$77,9,FALSE),IF($D13=\"Hot & Humid\",VLOOKUP($H13,Measures!$C$6:$W$19,9,FALSE),IF($D13=\"Hot & Dry\",VLOOKUP($H13,Measures!$C$20:$W$32,9,FALSE),IF($D13=\"Marine\",VLOOKUP($H13,Measures!$C$33:$W$45,9,FALSE),IF($D13=\"Cold\",VLOOKUP($H13,Measures!$C$46:$W$58,9,FALSE),IF($D13=\"Very Cold\",VLOOKUP($H13,Measures!$C$59:$W$72,9,FALSE),\" \"))))))","v":0.25545499999999999},{"$f":"IF(B13=0,\" \",PRODUCT(X13,E13,I13))","v":224800.40000000002},{"$f":"IF($G13=\"User-defined Measure\",VLOOKUP($H13,Measures!$C$73:$W$77,12,FALSE),IF($D13=\"Hot & Humid\",VLOOKUP($H13,Measures!$C$6:$W$19,12,FALSE),IF($D13=\"Hot & Dry\",VLOOKUP($H13,Measures!$C$20:$W$32,12,FALSE),IF($D13=\"Marine\",VLOOKUP($H13,Measures!$C$33:$W$45,12,FALSE),IF($D13=\"Cold\",VLOOKUP($H13,Measures!$C$46:$W$58,12,FALSE),IF($D13=\"Very Cold\",VLOOKUP($H13,Measures!$C$59:$W$72,12,FALSE),\" \"))))))","v":2.5499999999999998E-2},{"$f":"IF(B13=0,\" \",PRODUCT(Z13,E13,I13))","v":22440},{"$f":"IF(B13=0,\" \",Y13/AA13)","v":10.017843137254903},{"$f":"IF(B13=0,\" \",IF(W13 = 0, 0, Y13/W13))","v":2483.751471671877},{"$f":"IF(B13=0,\" \",RANK(AC13,AC$13:AC$68,1))","v":9}]
[null,"Program B","Site 3","Cold",2200000,"RFC West","Default","Standard Retrofit Package",0.2,"Medium",null,null,{"$f":"IF(F14<>0,VLOOKUP(F14,'Emission Factors'!$A$4:$J$31,7,FALSE),\" \")","v":8.2186499260643569E-3},{"$f":"IF($G14=\"User-defined Measure\",VLOOKUP($H14,Measures!$C$73:$W$77,16,FALSE),IF($D14=\"Hot & Humid\",VLOOKUP($H14,Measures!$C$6:$W$19,16,FALSE),IF($D14=\"Hot & Dry\",VLOOKUP($H14,Measures!$C$20:$W$32,16,FALSE),IF($D14=\"Marine\",VLOOKUP($H14,Measures!$C$33:$W$45,16,FALSE),IF($D14=\"Cold\",VLOOKUP($H14,Measures!$C$46:$W$58,16,FALSE),IF($D14=\"Very Cold\",VLOOKUP($H14,Measures!$C$59:$W$72,16,FALSE),\" \"))))))","v":13.750360000000001},{"$f":"IF($G14=\"User-defined Measure\",VLOOKUP($H14,Measures!$C$73:$W$77,19,FALSE),IF($D14=\"Hot & Humid\",VLOOKUP($H14,Measures!$C$6:$W$19,19,FALSE),IF($D14=\"Hot & Dry\",VLOOKUP($H14,Measures!$C$20:$W$32,19,FALSE),IF($D14=\"Marine\",VLOOKUP($H14,Measures!$C$33:$W$45,19,FALSE),IF($D14=\"Cold\",VLOOKUP($H14,Measures!$C$46:$W$58,19,FALSE),IF($D14=\"Very Cold\",VLOOKUP($H14,Measures!$C$59:$W$72,19,FALSE),\" \"))))))","v":19.5},33.250360000000001,14630158.4,49.724133886837656,{"$f":"IF(B14=0,\" \",PRODUCT(O14,'Emission Factors'!$J$36,E14,I14)/1000)","v":455.35776000000004},505.08189388683769,1.1479133951973584,{"$f":"IF($G14=\"User-defined Measure\",VLOOKUP($H14,Measures!$C$73:$X$77,22,FALSE),IF($D14=\"Hot & Humid\",VLOOKUP($H14,Measures!$C$6:$X$19,22,FALSE),IF($D14=\"Hot & Dry\",VLOOKUP($H14,Measures!$C$20:$X$32,22,FALSE),IF($D14=\"Marine\",VLOOKUP($H14,Measures!$C$33:$X$45,22,FALSE),IF($D14=\"Cold\",VLOOKUP($H14,Measures!$C$46:$X$58,22,FALSE),IF($D14=\"Very Cold\",VLOOKUP($H14,Measures!$C$59:$X$72,22,FALSE),\" \"))))))","v":20},{"$f":"IF(E14=0,\" \",V14*T14)","v":10101.637877736754},{"$f":"IF($G14=\"User-defined Measure\",VLOOKUP($H14,Measures!$C$73:$W$77,9,FALSE),IF($D14=\"Hot & Humid\",VLOOKUP($H14,Measures!$C$6:$W$19,9,FALSE),IF($D14=\"Hot & Dry\",VLOOKUP($H14,Measures!$C$20:$W$32,9,FALSE),IF($D14=\"Marine\",VLOOKUP($H14,Measures!$C$33:$W$45,9,FALSE),IF($D14=\"Cold\",VLOOKUP($H14,Measures!$C$46:$W$58,9,FALSE),IF($D14=\"Very Cold\",VLOOKUP($H14,Measures!$C$59:$W$72,9,FALSE),\" \"))))))","v":2.1949999999999998},965800,{"$f":"IF($G14=\"User-defined Measure\",VLOOKUP($H14,Measures!$C$73:$W$77,12,FALSE),IF($D14=\"Hot & Humid\",VLOOKUP($H14,Measures!$C$6:$W$19,12,FALSE),IF($D14=\"Hot & Dry\",VLOOKUP($H14,Measures!$C$20:$W$32,12,FALSE),IF($D14=\"Marine\",VLOOKUP($H14,Measures!$C$33:$W$45,12,FALSE),IF($D14=\"Cold\",VLOOKUP($H14,Measures!$C$46:$W$58,12,FALSE),IF($D14=\"Very Cold\",VLOOKUP($H14,Measures!$C$59:$W$72,12,FALSE),\" \"))))))","v":0.93500000000000005},411400.00000000006,2.3475935828877001,{"$f":"IF(B14=0,\" \",IF(W14 = 0, 0, Y14/W14))","v":95.608257956717125},5]
[null,"Program B","Site 3","Cold",2200000,"RFC West","Default","Major Renovation (Deep Retrofit) Package",0.1,"Low",null,null,{"$f":"IF(F15<>0,VLOOKUP(F15,'Emission Factors'!$A$4:$J$31,7,FALSE),\" \")","v":8.2186499260643569E-3},{"$f":"IF($G15=\"User-defined Measure\",VLOOKUP($H15,Measures!$C$73:$W$77,16,FALSE),IF($D15=\"Hot & Humid\",VLOOKUP($H15,Measures!$C$6:$W$19,16,FALSE),IF($D15=\"Hot & Dry\",VLOOKUP($H15,Measures!$C$20:$W$32,16,FALSE),IF($D15=\"Marine\",VLOOKUP($H15,Measures!$C$33:$W$45,16,FALSE),IF($D15=\"Cold\",VLOOKUP($H15,Measures!$C$46:$W$58,16,FALSE),IF($D15=\"Very Cold\",VLOOKUP($H15,Measures!$C$59:$W$72,16,FALSE),\" \"))))))","v":19.960199999999997},{"$f":"IF($G15=\"User-defined Measure\",VLOOKUP($H15,Measures!$C$73:$W$77,19,FALSE),IF($D15=\"Hot & Humid\",VLOOKUP($H15,Measures!$C$6:$W$19,19,FALSE),IF($D15=\"Hot & Dry\",VLOOKUP($H15,Measures!$C$20:$W$32,19,FALSE),IF($D15=\"Marine\",VLOOKUP($H15,Measures!$C$33:$W$45,19,FALSE),IF($D15=\"Cold\",VLOOKUP($H15,Measures!$C$46:$W$58,19,FALSE),IF($D15=\"Very Cold\",VLOOKUP($H15,Measures!$C$59:$W$72,19,FALSE),\" \"))))))","v":22},41.9602,9231244,36.090097175930545,{"$f":"IF(B15=0,\" \",PRODUCT(O15,'Emission Factors'!$J$36,E15,I15)/1000)","v":256.86847999999998},292.95857717593054,1.3316298962542297,{"$f":"IF($G15=\"User-defined Measure\",VLOOKUP($H15,Measures!$C$73:$X$77,22,FALSE),IF($D15=\"Hot & Humid\",VLOOKUP($H15,Measures!$C$6:$X$19,22,FALSE),IF($D15=\"Hot & Dry\",VLOOKUP($H15,Measures!$C$20:$X$32,22,FALSE),IF($D15=\"Marine\",VLOOKUP($H15,Measures!$C$33:$X$45,22,FALSE),IF($D15=\"Cold\",VLOOKUP($H15,Measures!$C$46:$X$58,22,FALSE),IF($D15=\"Very Cold\",VLOOKUP($H15,Measures!$C$59:$X$72,22,FALSE),\" \"))))))","v":20},5859.1715435186106,{"$f":"IF($G15=\"User-defined Measure\",VLOOKUP($H15,Measures!$C$73:$W$77,9,FALSE),IF($D15=\"Hot & Humid\",VLOOKUP($H15,Measures!$C$6:$W$19,9,FALSE),IF($D15=\"Hot & Dry\",VLOOKUP($H15,Measures!$C$20:$W$32,9,FALSE),IF($D15=\"Marine\",VLOOKUP($H15,Measures!$C$33:$W$45,9,FALSE),IF($D15=\"Cold\",VLOOKUP($H15,Measures!$C$46:$W$58,9,FALSE),IF($D15=\"Very Cold\",VLOOKUP($H15,Measures!$C$59:$W$72,9,FALSE),\" \"))))))","v":4.4249999999999998},973500,{"$f":"IF($G15=\"User-defined Measure\",VLOOKUP($H15,Measures!$C$73:$W$77,12,FALSE),IF($D15=\"Hot & Humid\",VLOOKUP($H15,Measures!$C$6:$W$19,12,FALSE),IF($D15=\"Hot & Dry\",VLOOKUP($H15,Measures!$C$20:$W$32,12,FALSE),IF($D15=\"Marine\",VLOOKUP($H15,Measures!$C$33:$W$45,12,FALSE),IF($D15=\"Cold\",VLOOKUP($H15,Measures!$C$46:$W$58,12,FALSE),IF($D15=\"Very Cold\",VLOOKUP($H15,Measures!$C$59:$W$72,12,FALSE),\" \"))))))","v":0.76500000000000001},168300,5.784313725490196,166.14976925822924,8]
{"$rows_left_out":59}
{"sheet":"Summary","index":2,"n_rows":72,"n_cols":12,"rows_kept":72,"cut":false,"hidden":false,"merged":[[7,9,7,10],[8,9,8,10],[7,7,7,8],[8,7,8,8],[1,1,1,4],[2,1,2,4],[7,3,7,4],[8,3,8,4]]}
[null,"Summary of Building Emissions: Reduction Opportunities"]
[null,"Agency:",null,null,null,{"$f":"Input!H3","v":"ABC"}]
[null,"Baseline Scope 1 & 2 Emissions:",null,null,null,{"$f":"Input!H4","v":40305755}]
[]
[]
[null,"Agency Totals"]
[]
[null,"Agency Name","Annual GHG Reduction Potential (MTCO2e/year)","Cumulative GHG Reduction Potential (MTCO2e)",null,"Capital Cost ($)","Annual Cost Savings ($/year)","Simple Payback\n(years)",null,"Cost Effectiveness ($/MTCO2e)",null,"GHG Percent Reduction from Baseline (%)"]
[null,{"$f":"F2","v":"ABC"},{"$f":"Input!T10","v":4183.7092057328009},{"$f":"Input!W10","v":83378.417959151586},null,{"$f":"Input!Y10","v":5766675.4000000004},{"$f":"Input!AA10","v":2160640},{"$f":"F9/G9","v":2.6689663247926543},null,{"$f":"F9/D9","v":69.162686713787096},null,{"$f":"C9/F3","v":1.0379930125940578E-4}]
[]
[null,"Program Totals"]
[null,"Up to 10 programs can be summarized in the following table.  If more programs are desired, insert additional rows, and copy and paste the formulas into the new rows.  "]
[null,"Program Name","Annual GHG Reduction Potential (MTCO2e/year)","Cumulative GHG Reduction Potential (MTCO2e)","Rank \n(on GHG Reduction Potential)","Capital Cost ($)","Annual Cost Savings ($/year)","Simple Payback\n(years)","Rank \n(on Simple Payback)","Cost Effectiveness ($/MTCO2e)","Rank\n(on Cost Effectiveness)","GHG Percent Reduction from Baseline (%)"]
[null,{"$f":"IF(OR('Pivot Tables'!A3=0,'Pivot Tables'!A3=\"(blank)\",'Pivot Tables'!A3=\"Grand Total\"), \" \",'Pivot Tables'!A3)","v":"Program B"},{"$f":"IF($B14=\" \",\" \",'Pivot Tables'!B3)","v":4183.7092057328009},{"$f":"IF($B14=\" \",\" \",'Pivot Tables'!E3)","v":83378.417959151586},{"$f":"IF(B14=\" \",\" \",RANK(C14,C$14:C$23,1))","v":1},{"$f":"IF(B14=\" \",\" \",'Pivot Tables'!C3)","v":5766675.4000000004},{"$f":"IF(B14=\" \",\" \",'Pivot Tables'!D3)","v":2160640},{"$f":"IF(C14=\" \",\" \",F14/G14)","v":2.6689663247926543},{"$f":"IF(B14=\" \",\" \",RANK(H14,H$14:H$23,1))","v":1},{"$f":"IF(B14=\" \",\" \",F14/D14)","v":69.162686713787096},{"$f":"IF(B14=\" \",\" \",RANK(J14,J$14:J$23,1))","v":1},{"$f":"IF(C14=\" \",\" \",C14/F$3)","v":1.0379930125940578E-4}]
[null,{"$f":"IF(OR('Pivot Tables'!A4=0,'Pivot Tables'!A4=\"(blank)\",'Pivot Tables'!A4=\"Grand Total\"), \" \",'Pivot Tables'!A4)","v":" "},{"$f":"IF(B15=\" \",\" \",'Pivot Tables'!B4)","v":" "},{"$f":"IF($B15=\" \",\" \",'Pivot Tables'!E4)","v":" "},{"$f":"IF(B15=\" \",\" \",RANK(C15,C$14:C$23,1))","v":" "},{"$f":"IF(B15=\" \",\" \",'Pivot Tables'!C4)","v":" "},{"$f":"IF(B15=\" \",\" \",'Pivot Tables'!D4)","v":" "}," "," ",{"$f":"IF(B15=\" \",\" \",F15/D15)","v":" "},{"$f":"IF(B15=\" \",\" \",RANK(J15,J$14:J$23,1))","v":" "}," "]
{"$rows_left_out":58}
{"sheet":"Graphs","index":3,"n_rows":0,"n_cols":0,"rows_kept":0,"cut":false,"hidden":false,"merged":[]}

{"sheet":"Measures","index":4,"n_rows":77,"n_cols":24,"rows_kept":77,"cut":false,"hidden":false,"merged":[[1,1,2,1]]}
[]
[null,"Office","Default Proxy Bldg Size",200000,"SF"]
[null,null,"User-defined Proxy Bldg Size",200000,"SF"]
[null,"VLOOKUP",1,2,3,4,5,6,7,8,9,10,11,12,13,14,15,16,17,18,19,20,21,22]
["Building Type","Retrofit Number","Retrofit Description","Climate","Measure Costs ($)","Energy Cost Savings ($)","O&M Cost Savings ($)","Total Savings ($)","Simple Payback (Years)","Net Present Value","Measure Cost Index ($/sf)","Energy Savings Index ($/sf)","O&M Savings Index ($/sf)","Total Savings  Index ($/sf)","NPV Index ($/sf)","Electric energy savings (kWh)","Electric energy savings Index (kWh/SF)","Electric energy savings Index (kBtu/SF)","Electric demand savings (kW)","Gas savings (therms)","Gas Savings Index (kBtu/SF)","EUI reduction (kBtu/sf)","Savings as % of total site usage","Effective Useful Life"]
["Office",1,"RCx (EBCx) Package","Hot & Humid",61100,36300,0,36300,2,244000,{"$f":"E6/$D$2","v":0.30549999999999999},0.18149999999999999,{"$f":"IF(G6<>0,G6/$D$2,0)","v":0},{"$f":"H6/$D$2","v":0.18149999999999999},{"$f":"J6/$D$2","v":1.22},319000,{"$f":"P6/$D$2","v":1.595},{"$f":"Q6*'Emission Factors'!$L$1/1000","v":5.4421400000000002},4,16000,{"$f":"IF(T6<>0,T6*100/$D$2,0)","v":8},13,0.15,20]
["Office",2,"Standard Retrofit Package","Hot & Humid",422000,141000,-4100,137000,3,753000,2.11,0.70499999999999996,{"$f":"IF(G7<>0,G7/$D$2,0)","v":-2.0500000000000001E-2},{"$f":"H7/$D$2","v":0.68500000000000005},3.7650000000000001,900000,4.5,{"$f":"Q7*'Emission Factors'!$L$1/1000","v":15.353999999999999},170,28000,14,29,0.33,20]
["Office",3,"Major Renovation (Deep Retrofit) Package","Hot & Humid",697000,115000,1500,117000,6,227000,3.4849999999999999,0.57499999999999996,{"$f":"IF(G8<>0,G8/$D$2,0)","v":7.4999999999999997E-3},{"$f":"H8/$D$2","v":0.58499999999999996},1.135,1520000,7.6,{"$f":"Q8*'Emission Factors'!$L$1/1000","v":25.931199999999997},290,28000,14,40,0.45,20]
[]
["Office",4,"Install occupancy sensors for lighting","Hot & Humid",75609,9792,-652,9140,8,11485,{"$f":"E10/$D$2","v":0.37804500000000002},{"$f":"F10/$D$2","v":4.8959999999999997E-2},{"$f":"IF(G10<>0,G10/$D$2,0)","v":-3.2599999999999999E-3},{"$f":"H10/$D$2","v":4.5699999999999998E-2},5.7424999999999997E-2,108944,0.54471999999999998,{"$f":"Q10*'Emission Factors'!$L$1/1000","v":1.8585846400000001},32,-1174,-0.58699999999999997,1.3,1.7000000000000001E-2,10]
["Office",5,"Install daylight harvesting sensors","Hot & Humid",109452,17085,-1304,15782,7,72057,0.54725999999999997,8.5425000000000001E-2,-6.5199999999999998E-3,7.8909999999999994E-2,0.36028500000000002,177969,0.889845,{"$f":"Q11*'Emission Factors'!$L$1/1000","v":3.0361511399999999},82,-3110,-1.5549999999999999,1.5,0.02,20]
["Office",6,"Exterior light fixture upgrade, light level reduction, and controls.","Hot & Humid",87534,5840,0,5840,16,-8221,0.43767,2.92E-2,0,2.92E-2,-4.1105000000000003E-2,100314,0.50156999999999996,{"$f":"Q12*'Emission Factors'!$L$1/1000","v":1.7113568399999999},0,0,0,1.7,2.3E-2,7]
["Office",7,"Implement seasonal temperature setpoints (69°F heating setpoint, 75°F cooling setpoint) (pneumatic zone controls)","Hot & Humid",63390,17075,0,17075,4,153357,0.31695000000000001,8.5375000000000006E-2,0,8.5375000000000006E-2,0.76678500000000005,60669,0.30334499999999998,{"$f":"Q13*'Emission Factors'!$L$1/1000","v":1.03501314},40,8899,4.4494999999999996,5.5,7.2999999999999995E-2,13]
["Office",8,"Reduce ventilation during unoccupied periods (pneumatic zone controls)","Hot & Humid",36684,17654,-2173,15481,2,141767,0.18342,8.8270000000000001E-2,-1.0865E-2,7.7405000000000002E-2,0.70883499999999999,131397,0.65698500000000004,{"$f":"Q14*'Emission Factors'!$L$1/1000","v":2.2416328200000004},2,8029,4.0145,6.3,8.3000000000000004E-2,13]
["Office",9,"Implement seasonal temperature setpoints (69°F heating setpoint, 75°F cooling setpoint) (DDC zone controls)","Hot & Humid",36684,17654,-2173,15481,2,141767,0.18342,8.8270000000000001E-2,-1.0865E-2,7.7405000000000002E-2,0.70883499999999999,131397,0.65698500000000004,{"$f":"Q15*'Emission Factors'!$L$1/1000","v":2.2416328200000004},2,8029,4.0145,6.3,8.3000000000000004E-2,13]
{"$rows_left_out":63}
{"sheet":"References","index":5,"n_rows":38,"n_cols":1,"rows_kept":38,"cut":false,"hidden":false,"merged":[]}
["References and Resources"]
["The following resources provided reference data for the analysis contained in this estimator worksheet.  Additional GHG reduction resources are available through the Federal Energy Management Program (FEMP) at "]
[]
["DOE - Department of Energy. 2011. Advanced Energy Retrofit Guides Office Buildings. PNNL-20761, Richland, WA.  Available at http://www.pnnl.gov/main/publications/external/technical_reports/PNNL-20761.pdf "]
["EPA - Environmental Protection Agency. 2012. Emissions & Generation Resource Integrated Database (eGRID) 2012 Version 1.0. Available at http://www.epa.gov/cleanenergy/documents/egridzips/eGRID2012V1_0_year09_DATA.xls"]
["EIA - Energy Information Administration. 2003.  Commercial Building Energy Consumption Survey 2003.  Available at http://www.eia.gov/emeu/cbecs/cbecs2003/detailed_tables_2003/detailed_tables_2003.html#consumexpen03"]
[]
[]
["eGRID Region Map"]
["Source: U.S. EPA http://www.epa.gov/cleanenergy/documents/egridzips/eGRID2012_eGRID_subregions.jpg "]
[]
[]
[]
[]
[]
{"$rows_left_out":24}
{"sheet":"Pivot Tables","index":6,"n_rows":75,"n_cols":5,"rows_kept":75,"cut":false,"hidden":false,"merged":[]}
["DO NOT EDIT - This is linked to the 'Summary' worksheet"]
["Row Labels","Sum of Annual GHG Reduction (MTCO2e/year)","Sum of Capital Cost ($)","Sum of Annual Cost Savings ($/year)","Sum of Cumulative GHG Reduction (MTCO2e)"]
["Program B",4183.7092057328009,5766675.4000000004,2160640,83378.417959151586]
["(blank)",0,0,0,0]
["Grand Total",4183.7092057328009,5766675.4000000004,2160640,83378.417959151586]
[]
[]
[]
[]
[]
[]
[]
[]
[]
[]
{"$rows_left_out":61}
{"sheet":"Emission Factors","index":7,"n_rows":36,"n_cols":13,"rows_kept":36,"cut":false,"hidden":false,"merged":[[1,5,1,9]]}
["eGRID 2012 Emission Factors (2009 Year Data)",null,null,null,null,null,null,null,null,null,"Conversion:",3412,"kBtu/MWh"]
[null,null,null,null,null,"Baseload Emission Factors"]
["eGRID Subregion","eGRID Subregion Acronym","CO2 (lb/MWh)","CH4\n (lb/GWh)","N20 (lb/GWh)","CO2 (kg/MWh)","CH4 (kg/MWh)","N20 (kg/MWh)","CO2e (kg/MWh)","CO2e (kg/kBtu)"]
["ASCC Alaska Grid","AKGD",1280.8599999999999,27.736999999999998,7.6877000000000004,{"$f":"C4/2.20462","v":580.9890139797335},{"$f":"D4/2.20462/1000","v":1.2581306529016338E-2},{"$f":"E4/2.20462/1000","v":3.4870862098683678E-3},{"$f":"F4+(G4*21)+(H4*310)","v":582.33421814190206},{"$f":"I4/$L$1","v":0.17067239687629016}]
["ASCC Miscellaneous","AKMS",521.26,21.7818,4.2813999999999997,{"$f":"C5/2.20462","v":236.43983997242157},{"$f":"D5/2.20462/1000","v":9.8800700347452183E-3},{"$f":"E5/2.20462/1000","v":1.942012682457748E-3},237.2493453747131,6.9533805795636894E-2]
["WECC Southwest","AZNM",1191.3499999999999,19.131699999999999,15.581799999999999,540.38791265614941,8.6780034654498281E-3,7.0677939962442505E-3,542.76116686775958,0.15907419896475955]
["WECC California","CAMX",658.68,28.9404,6.1653000000000002,298.77257758706719,1.312716023623119E-2,2.7965363645435495E-3,299.91517422503654,8.790010967908457E-2]
["ERCOT All","ERCT",1181.73,16.702999999999999,13.1035,536.02434886737854,7.5763623663034898E-3,5.9436546887899058E-3,538.02598543059571,0.1576863966678182]
["FRCC All","FRCC",1176.6099999999999,39.238,13.5329,533.701953171068,1.7798078580435632E-2,6.1384274841015688E-3,535.97862534132867,0.15708634974833782]
["HICC Miscellaneous","HIMS",1351.66,72.398600000000002,13.8041,613.10339196777682,3.2839491613067109E-2,6.2614418811405151E-3,615.73406827480483,0.18046133302309636]
["HICC Oahu","HIOA",1593.35,101.7449,21.980499999999999,722.73226224927657,4.6150765211238225E-2,9.9701989458500784E-3,726.79218999192608,0.21301060667993144]
["MRO East","MORE",1591.65,23.980899999999998,27.0413,721.96115430323607,1.0877566201885132E-2,1.2265741941921964E-2,725.9919631954715,0.21277607362118156]
["MRO West","MROW",1628.6,28.798300000000001,27.790199999999999,738.72141230688283,1.3062704683800386E-2,1.2605437671798315E-2,742.90341478350012,0.21773253657195196]
["NPCC New England","NEWE",728.41,75.684200000000004,13.855,330.40161116201432,3.4329816476308853E-2,6.2845297602307885E-3,333.07074153368836,9.7617450625348295E-2]
["WECC Northwest","NWPP",819.21,15.293100000000001,12.500400000000001,371.58784733877047,6.936841723290183E-3,5.6700928051092708E-3,373.49124978454347,0.10946402396967862]
{"$rows_left_out":22}
{"sheet":"Drop down menus","index":8,"n_rows":17,"n_cols":1,"rows_kept":17,"cut":false,"hidden":false,"merged":[]}
["Drop Down Menu Values"]
[]
["Zone"]
["Hot & Humid"]
["Hot & Dry"]
["Marine"]
["Cold"]
["Very Cold"]
[]
["Measure"]
["Default"]
["User-defined Measure"]
[]
["Ease of Implementation"]
["Low"]
{"$rows_left_out":2}